{"text_format":"1","workbook":"xlsx","n_sheets":24,"sheets":["INFO Blatt","Ergebnisse","Startreihenfolge","Formeln","Hehlen","TG Oker SZ 1","TG Oker SZ 2","Einbeck 1","Boffzen","Einbeck 2","TG Hehlen Dielmissen","M8","M9","M10","Wertungszettel M1","Wertungszettel M2","Wertungszettel M3","Wertungszettel M4","Wertungszettel M5","Wertungszettel M6","Wertungszettel M7","Wertungszettel M8","Wertungszettel M9","Wertungszettel M10"],"not_rendered":{"charts":0,"images":8,"macros":1,"external_links":1,"defined_names":24,"comments":2,"pivot_tables":0},"unopened":[],"bounds":{"document_bytes":16777216,"sheet_cells":100000,"rows_first":2000,"rows_last":500,"rows_between":2000,"halvings":0,"cell_chars":16384,"cell_head_chars":4096},"cells_cut":0,"cells_raw":0,"read":"whole","date_system":"1900"}

{"sheet":"INFO Blatt","index":0,"n_rows":40,"n_cols":2,"rows_kept":40,"cut":false,"hidden":false,"merged":[[37,0,37,5],[30,1,30,5],[31,1,31,5],[23,1,23,5],[24,1,24,5],[25,0,25,5],[26,0,26,5],[27,1,27,5],[28,1,28,5],[29,0,29,5],[32,1,32,5],[33,0,33,5],[34,1,34,5],[35,1,35,5],[36,1,36,5],[21,0,21,5],[22,0,22,5],[15,0,15,5],[19,1,19,5],[20,1,20,5],[18,0,18,5],[17,0,17,5]]}
["INFO"]
[]
["Mannschaften",7]
[]
["Wertungsvorschrift","P-Stufen"]
[]
["Liga","Schülerliga Süd"]
[]
["Wettkampftag","3."]
[]
["Ort","Hehlen"]
[]
["Datum","2018-03-03"]
[]
[]
["Kleine Einführung in die Auswertung:"]
[]
["1.       Es wird MS Ecxel ab 2007 benötigt. Auf Wunsch kann ich es auch in die 97 Version runterspeichern."]
["2.       Bitte die Datei für den 1 Wettkampftag öffnen. Bzw. den aktuellen. Die Ergebnisse werden von dem letzten                Wettkampftag eingelesen. Dort müsste eventuell der Datenpfad geändert werden."]
[null,"a.       Im Datenblatt Formeln / Daten à Verknüpfung bearbeiten à Quelle ändern à die Datei des letzten Wettkampfes angeben."]
[null,"b.      Wenn ich die Ergebnisse bekomme, kann ich auch die aktuelle Datei an den Ausrichter senden."]
["3.       Für den Wettkampf müssen die Wettkampfzettel ausgedruckt werden. Es gibt immer 2stk. pro Mannschaft. Dort sind immer 3 Geräte aufgeführt. Die Zettel können abwechseln eingegeben werden bzw. am Kari Tisch liegen."]
["4.       Es wird empfohlen das vor Wettkampfbeginn alle anwesenden Turner in die Auswertungstabellen eingelesen werden. Dazu in der Tabelle der Mannschaft / Spalte Namen und dem ersten Namensfeld auf den Pfeil klicken. Es werden alle gemeldeten Turner der Mannschaft aufgelistet."]
[null,"a.       Wenn die Reihenfolge der Wertungszettel  übernommen wird ist es einfacher für die Eingabe. "]
[null,"b.      Falls ein Turner fehlt oder ein Rechtschreibfehler vorliegt. Kann dies unter dem Datenblatt „Wertungszettel M?“ (Nummer der Mannschaft) geändert werden. Danach im muss der Turner neu angewählt werden. Um die Änderung anzuzeigen!"]
["5.       Die Wertungen müssen dann unter den Mannschaften eingetragen werden."]
["Bitte den"]
[null,"a.       Ausgang : 1,4 bzw. bei P-Stufen für P7  = 7"]
[null,"b.       E-Abzug: die Abzüge eintragen ( z.B.1,8) bitte immer 2 Werte eintragen"]
["6.       Platzierungen kann man und dem Datenblatt „Ergebnisse“ finden. Zum Sortieren auf den Button klicken."]
[null,"a.       Achtung dafür müssen die Makro aktiviert sein. Die Dateien sind mit Norton Antivir geprüft."]
[null,"b.      Die Seite ist so ein gestellt das Seite 1 die Mannschaftergebnisse sind und die folgenden die             Einzelergebnisse"]
[null,"c.    Die Arbeitsmappe wird nach dem sortieren automatisch gespeichert."]
["7.        AK Turner werden in dem Programm wie folgt behandelt"]
[null,"a.    Ausgang: Ausgangswerte für Ak Turner müssen negativ eingegeben werden z.B. P7 = -7"]
[null,"b.    Die Endwerte der Ak Turner werden vom Programm automatisch farblich markiert"]
[null,"c.    Für die Einzelergebnisse der Turner werden alle Endwerte korrekt berücksichtigt"]
["8.       Falls Fragen und Hilfen benötigt wird bitte einfach mailen carsten.jeschke@t-online.de"]
[]
[null,"© Alexander Gläsener"]

{"sheet":"Ergebnisse","index":1,"n_rows":91,"n_cols":14,"rows_kept":91,"cut":false,"hidden":false,"merged":[[36,8,36,9],[6,0,6,1],[6,8,6,9],[6,10,6,11],[34,8,34,9],[34,10,34,11],[8,0,8,3],[8,8,8,12]]}
[]
[]
[]
[]
[]
[]
[{"$f":"'INFO Blatt'!B7","v":"Schülerliga Süd"},null,{"$f":"'INFO Blatt'!B11","v":"Hehlen"},{"$f":"'INFO Blatt'!B13","v":"2018-03-03"},null,null,null,null,{"$f":"A7","v":"Schülerliga Süd"},null,{"$f":"C7","v":"Hehlen"},null,{"$f":"D7","v":"2018-03-03"}]
[]
["Einzelergebnisse",null,null,null,null,null,null,null,"Mannschaftsergebnisse"]
[]
["Platz","Name","Verein","Punkte "]
[{"$f":"IF(D12=0,F12*10+1,RANK(D12,D$12:D$91,0))","v":1},{"$f":"Hehlen!A15","v":"Niclas Brinkmann"},{"$f":"Hehlen!B15","v":"TC Jahn Hehlen"},{"$f":"Hehlen!AB15","v":97.25},null,{"$f":"'INFO Blatt'!B3","v":7}]
[{"$f":"IF(D13=0,F13*10+1,RANK(D13,D$12:D$91,0))","v":2},{"$f":"'TG Oker SZ 1'!A15","v":"Robert Knoke"},{"$f":"'TG Oker SZ 1'!B15","v":"TG Oker Salzgitter 1"},{"$f":"'TG Oker SZ 1'!AB15","v":96.8},null,{"$f":"F12","v":7},null,null,"Platz","Verein","WK Punkte","Gerät Punkt","Punkte","Nach Geräten"]
[{"$f":"IF(D14=0,F14*10+1,RANK(D14,D$12:D$91,0))","v":3},{"$f":"'Einbeck 2'!A13","v":"Leon Freye"},{"$f":"'Einbeck 2'!B13","v":"Einbecker SV 2"},{"$f":"'Einbeck 2'!AB13","v":90.9},null,{"$f":"F13","v":7},null,null,{"$f":"Formeln!C7","v":1},{"$f":"Formeln!A7","v":"TG Oker Salzgitter 1"},{"$f":"Formeln!D7","v":14},{"$f":"Formeln!E7","v":78},{"$f":"Formeln!B7","v":270.35000000000002},{"$f":"'TG Oker SZ 1'!AG18","v":6}]
[{"$f":"IF(D15=0,F15*10+1,RANK(D15,D$12:D$91,0))","v":4},{"$f":"'TG Oker SZ 1'!A9","v":"Nils Honisch"},{"$f":"'TG Oker SZ 1'!B9","v":"TG Oker Salzgitter 1"},{"$f":"'TG Oker SZ 1'!AB9","v":88.750000000000014},null,7,null,null,{"$f":"Formeln!C10","v":2},{"$f":"Formeln!A10","v":"Einbecker SV 2"},{"$f":"Formeln!D10","v":12},{"$f":"Formeln!E10","v":72},{"$f":"Formeln!B10","v":268.54999999999995},{"$f":"'Einbeck 2'!AG18","v":6}]
[{"$f":"IF(D16=0,F16*10+1,RANK(D16,D$12:D$91,0))","v":5},{"$f":"'Einbeck 2'!A11","v":"Dominik Kumarasamy"},{"$f":"'Einbeck 2'!B11","v":"Einbecker SV 2"},{"$f":"'Einbeck 2'!AB11","v":86.9},null,7,null,null,{"$f":"Formeln!C6","v":3},{"$f":"Formeln!A6","v":"TC Jahn Hehlen"},{"$f":"Formeln!D6","v":10},{"$f":"Formeln!E6","v":66},{"$f":"Formeln!B6","v":261.8},{"$f":"Hehlen!AG18","v":6}]
[{"$f":"IF(D17=0,F17*10+1,RANK(D17,D$12:D$91,0))","v":6},{"$f":"'Einbeck 2'!A9","v":"Wiliam Lampe"},{"$f":"'Einbeck 2'!B9","v":"Einbecker SV 2"},{"$f":"'Einbeck 2'!AB9","v":84.8}," ",7,null,null,{"$f":"Formeln!C5","v":4},{"$f":"Formeln!A5","v":"MTV Boffzen"},{"$f":"Formeln!D5","v":8},{"$f":"Formeln!E5","v":40},{"$f":"Formeln!B5","v":240.35000000000002},{"$f":"Boffzen!AG18","v":6}]
[{"$f":"IF(D18=0,F18*10+1,RANK(D18,D$12:D$91,0))","v":7},{"$f":"Boffzen!A13","v":"Marc Ormann"},{"$f":"Boffzen!B13","v":"MTV Boffzen"},{"$f":"Boffzen!AB13","v":83.4},null,7,null,null,{"$f":"Formeln!C8","v":5},{"$f":"Formeln!A8","v":"TG Oker Salzgitter 2"},{"$f":"Formeln!D8","v":6},{"$f":"Formeln!E8","v":30},{"$f":"Formeln!B8","v":232.05},{"$f":"'TG Oker SZ 2'!AG18","v":6}]
[{"$f":"IF(D19=0,F19*10+1,RANK(D19,D$12:D$91,0))","v":8},{"$f":"'TG Oker SZ 1'!A11","v":"Tim Honisch"},{"$f":"'TG Oker SZ 1'!B11","v":"TG Oker Salzgitter 1"},{"$f":"'TG Oker SZ 1'!AB11","v":82.2},null,7,null,null,{"$f":"Formeln!C11","v":6},{"$f":"Formeln!A11","v":"TG Hehlen Dielmissen"},{"$f":"Formeln!D11","v":4},{"$f":"Formeln!E11","v":32},{"$f":"Formeln!B11","v":228.60000000000002},{"$f":"'TG Hehlen Dielmissen'!AG18","v":6}]
[{"$f":"IF(D20=0,F20*10+1,RANK(D20,D$12:D$91,0))","v":9},{"$f":"Hehlen!A23","v":"Frederik Zwickert"},{"$f":"Hehlen!B23","v":"TC Jahn Hehlen"},{"$f":"Hehlen!AB23","v":81.05},null,7,null,null,{"$f":"Formeln!C9","v":7},{"$f":"Formeln!A9","v":"Einbecker SV 1"},{"$f":"Formeln!D9","v":2},{"$f":"Formeln!E9","v":18},{"$f":"Formeln!B9","v":216.29999999999998},{"$f":"'Einbeck 1'!AG18","v":6}]
[{"$f":"IF(D21=0,F21*10+1,RANK(D21,D$12:D$91,0))","v":10},{"$f":"Hehlen!A11","v":"Benjamin Berg"},{"$f":"Hehlen!B11","v":"TC Jahn Hehlen"},{"$f":"Hehlen!AB11","v":80.45},null,7,null,null,{"$f":"Formeln!C12","v":8},{"$f":"Formeln!A12","v":"M8"},{"$f":"Formeln!D12","v":0},{"$f":"Formeln!E12","v":0},{"$f":"Formeln!B12","v":0},{"$f":"'M8'!AG18","v":0}]
[{"$f":"IF(D22=0,F22*10+1,RANK(D22,D$12:D$91,0))","v":11},{"$f":"'TG Oker SZ 2'!A15","v":"Eric Siebenhaar"},{"$f":"'TG Oker SZ 2'!B15","v":"TG Oker Salzgitter 2"},{"$f":"'TG Oker SZ 2'!AB15","v":79.05},null,7]
[{"$f":"IF(D23=0,F23*10+1,RANK(D23,D$12:D$91,0))","v":12},{"$f":"Boffzen!A15","v":"Erik Schäfer"},{"$f":"Boffzen!B15","v":"MTV Boffzen"},{"$f":"Boffzen!AB15","v":78.75},null,7]
[{"$f":"IF(D24=0,F24*10+1,RANK(D24,D$12:D$91,0))","v":12},{"$f":"'Einbeck 1'!A9","v":"Tom Leonhard"},{"$f":"'Einbeck 1'!B9","v":"Einbecker SV 1"},{"$f":"'Einbeck 1'!AB9","v":78.75},null,7,null,null,null,null,null,null," "]
[{"$f":"IF(D25=0,F25*10+1,RANK(D25,D$12:D$91,0))","v":14},{"$f":"Boffzen!A17","v":"Emil Meisner"},{"$f":"Boffzen!B17","v":"MTV Boffzen"},{"$f":"Boffzen!AB17","v":77.099999999999994},null,7]
[{"$f":"IF(D26=0,F26*10+1,RANK(D26,D$12:D$91,0))","v":15},{"$f":"'TG Oker SZ 2'!A13","v":"Emmanuel Taube"},{"$f":"'TG Oker SZ 2'!B13","v":"TG Oker Salzgitter 2"},{"$f":"'TG Oker SZ 2'!AB13","v":76.850000000000009},null,7]
[{"$f":"IF(D27=0,F27*10+1,RANK(D27,D$12:D$91,0))","v":15},{"$f":"Hehlen!A17","v":"Jonas Firedrich"},{"$f":"Hehlen!B17","v":"TC Jahn Hehlen"},{"$f":"Hehlen!AB17","v":76.850000000000009},null,7]
[{"$f":"IF(D28=0,F28*10+1,RANK(D28,D$12:D$91,0))","v":17},{"$f":"'TG Hehlen Dielmissen'!A9","v":"Viktor Brauer"},{"$f":"'TG Hehlen Dielmissen'!B9","v":"TG Hehlen Dielmissen"},{"$f":"'TG Hehlen Dielmissen'!AB9","v":76.25},null,7]
[{"$f":"IF(D29=0,F29*10+1,RANK(D29,D$12:D$91,0))","v":18},{"$f":"'TG Hehlen Dielmissen'!A19","v":"Yvo Vehling"},{"$f":"'TG Hehlen Dielmissen'!B19","v":"TG Hehlen Dielmissen"},{"$f":"'TG Hehlen Dielmissen'!AB19","v":76.150000000000006},null,7]
[{"$f":"IF(D30=0,F30*10+1,RANK(D30,D$12:D$91,0))","v":19},{"$f":"Hehlen!A19","v":"Ilja Kant"},{"$f":"Hehlen!B19","v":"TC Jahn Hehlen"},{"$f":"Hehlen!AB19","v":75.55},null,7]
[{"$f":"IF(D31=0,F31*10+1,RANK(D31,D$12:D$91,0))","v":20},{"$f":"'TG Hehlen Dielmissen'!A11","v":"Norwin Eilers"},{"$f":"'TG Hehlen Dielmissen'!B11","v":"TG Hehlen Dielmissen"},{"$f":"'TG Hehlen Dielmissen'!AB11","v":75.3},null,7]
[{"$f":"IF(D32=0,F32*10+1,RANK(D32,D$12:D$91,0))","v":21},{"$f":"'TG Oker SZ 2'!A11","v":"Jamie Schnabel"},{"$f":"'TG Oker SZ 2'!B11","v":"TG Oker Salzgitter 2"},{"$f":"'TG Oker SZ 2'!AB11","v":73.649999999999991},null,7]
[{"$f":"IF(D33=0,F33*10+1,RANK(D33,D$12:D$91,0))","v":22},{"$f":"'TG Oker SZ 2'!A9","v":"Patrick Gernowski"},{"$f":"'TG Oker SZ 2'!B9","v":"TG Oker Salzgitter 2"},{"$f":"'TG Oker SZ 2'!AB9","v":73.55},null,7]
[{"$f":"IF(D34=0,F34*10+1,RANK(D34,D$12:D$91,0))","v":23},{"$f":"'TG Hehlen Dielmissen'!A13","v":"Thore Gruppe"},{"$f":"'TG Hehlen Dielmissen'!B13","v":"TG Hehlen Dielmissen"},{"$f":"'TG Hehlen Dielmissen'!AB13","v":72.95},null,7]
[{"$f":"IF(D35=0,F35*10+1,RANK(D35,D$12:D$91,0))","v":24},{"$f":"Boffzen!A11","v":"Moritz Böhm"},{"$f":"Boffzen!B11","v":"MTV Boffzen"},{"$f":"Boffzen!AB11","v":72.949999999999989},null,7,null,null,{"$f":"I7","v":"Schülerliga Süd"},null,{"$f":"K7","v":"Hehlen"},null,{"$f":"M7","v":"2018-03-03"}]
[{"$f":"IF(D36=0,F36*10+1,RANK(D36,D$12:D$91,0))","v":25},{"$f":"'Einbeck 1'!A17","v":"Marlon Sassin"},{"$f":"'Einbeck 1'!B17","v":"Einbecker SV 1"},{"$f":"'Einbeck 1'!AB17","v":68.8},null,7]
[{"$f":"IF(D37=0,F37*10+1,RANK(D37,D$12:D$91,0))","v":26},{"$f":"'Einbeck 2'!A17","v":"Lu Rosebrock"},{"$f":"'Einbeck 2'!B17","v":"Einbecker SV 2"},{"$f":"'Einbeck 2'!AB17","v":63.5},null,7,null,null,"Ergebnis nach dem ",null,{"$f":"'INFO Blatt'!B9","v":"3."}," Wettkampftag"]
[{"$f":"IF(D38=0,F38*10+1,RANK(D38,D$12:D$91,0))","v":27},{"$f":"'TG Oker SZ 2'!A17","v":"Lasse Sticka"},{"$f":"'TG Oker SZ 2'!B17","v":"TG Oker Salzgitter 2"},{"$f":"'TG Oker SZ 2'!AB17","v":62.599999999999994},null,7]
[{"$f":"IF(D39=0,F39*10+1,RANK(D39,D$12:D$91,0))","v":28},{"$f":"'Einbeck 2'!A15","v":"Johann Mickat"},{"$f":"'Einbeck 2'!B15","v":"Einbecker SV 2"},{"$f":"'Einbeck 2'!AB15","v":60.65},null,7,null,null,"Platz","Verein","WK Punkte","Gerät Punkt","Punkte"]
[{"$f":"IF(D40=0,F40*10+1,RANK(D40,D$12:D$91,0))","v":29},{"$f":"'Einbeck 1'!A25","v":"Joel Eitemeier"},{"$f":"'Einbeck 1'!B25","v":"Einbecker SV 1"},{"$f":"'Einbeck 1'!AB25","v":56.75},null,7,null,null,{"$f":"Formeln!H10","v":1},{"$f":"Formeln!G10","v":"Einbecker SV 2"},{"$f":"Formeln!I10","v":36},{"$f":"Formeln!J10","v":210},{"$f":"Formeln!K10","v":794.09999999999991}]
[{"$f":"IF(D41=0,F41*10+1,RANK(D41,D$12:D$91,0))","v":30},{"$f":"'TG Oker SZ 1'!A17","v":"Leon Müller"},{"$f":"'TG Oker SZ 1'!B17","v":"TG Oker Salzgitter 1"},{"$f":"'TG Oker SZ 1'!AB17","v":55.949999999999996},null,7,null,null,{"$f":"Formeln!H7","v":2},{"$f":"Formeln!G7","v":"TG Oker Salzgitter 1"},{"$f":"Formeln!I7","v":36},{"$f":"Formeln!J7","v":198},{"$f":"Formeln!K7","v":782.69500000000005}]
[{"$f":"IF(D42=0,F42*10+1,RANK(D42,D$12:D$91,0))","v":31},{"$f":"'Einbeck 1'!A23","v":"Fiete Linneweber"},{"$f":"'Einbeck 1'!B23","v":"Einbecker SV 1"},{"$f":"'Einbeck 1'!AB23","v":55.599999999999994},null,7,null,null,{"$f":"Formeln!H6","v":3},{"$f":"Formeln!G6","v":"TC Jahn Hehlen"},{"$f":"Formeln!I6","v":34},{"$f":"Formeln!J6","v":216},{"$f":"Formeln!K6","v":790.45}]
[{"$f":"IF(D43=0,F43*10+1,RANK(D43,D$12:D$91,0))","v":32},{"$f":"'TG Oker SZ 1'!A21","v":"Christian Rath"},{"$f":"'TG Oker SZ 1'!B21","v":"TG Oker Salzgitter 1"},{"$f":"'TG Oker SZ 1'!AB21","v":54.8},null,7,null,null,{"$f":"Formeln!H5","v":4},{"$f":"Formeln!G5","v":"MTV Boffzen"},{"$f":"Formeln!I5","v":26},{"$f":"Formeln!J5","v":140},{"$f":"Formeln!K5","v":736.6}]
[{"$f":"IF(D44=0,F44*10+1,RANK(D44,D$12:D$91,0))","v":33},{"$f":"'TG Oker SZ 1'!A13","v":"Jarik Siebold"},{"$f":"'TG Oker SZ 1'!B13","v":"TG Oker Salzgitter 1"},{"$f":"'TG Oker SZ 1'!AB13","v":50.999999999999993},null,7,null,null,{"$f":"Formeln!H8","v":5},{"$f":"Formeln!G8","v":"TG Oker Salzgitter 2"},{"$f":"Formeln!I8","v":16},{"$f":"Formeln!J8","v":96},{"$f":"Formeln!K8","v":703.25}]
[{"$f":"IF(D45=0,F45*10+1,RANK(D45,D$12:D$91,0))","v":34},{"$f":"Hehlen!A13","v":"Niklas Bohlender"},{"$f":"Hehlen!B13","v":"TC Jahn Hehlen"},{"$f":"Hehlen!AB13","v":41.45},null,7,null,null,{"$f":"Formeln!H9","v":6},{"$f":"Formeln!G9","v":"Einbecker SV 1"},{"$f":"Formeln!I9","v":12},{"$f":"Formeln!J9","v":78},{"$f":"Formeln!K9","v":686.84999999999991}]
[{"$f":"IF(D46=0,F46*10+1,RANK(D46,D$12:D$91,0))","v":71},{"$f":"Boffzen!A25","v":0},{"$f":"Boffzen!B25","v":""},{"$f":"Boffzen!AB25","v":0},null,7,null,null,{"$f":"Formeln!H11","v":7},{"$f":"Formeln!G11","v":"TG Hehlen Dielmissen"},{"$f":"Formeln!I11","v":8},{"$f":"Formeln!J11","v":72},{"$f":"Formeln!K11","v":688.05000000000007}]
[{"$f":"IF(D47=0,F47*10+1,RANK(D47,D$12:D$91,0))","v":71},{"$f":"Boffzen!A27","v":0},{"$f":"Boffzen!B27","v":""},{"$f":"Boffzen!AB27","v":0},null,7,null,null,{"$f":"Formeln!H12","v":8},{"$f":"Formeln!G12","v":"M8"},{"$f":"Formeln!I12","v":0},{"$f":"Formeln!J12","v":0},{"$f":"Formeln!K12","v":0}]
[{"$f":"IF(D48=0,F48*10+1,RANK(D48,D$12:D$91,0))","v":71},{"$f":"Hehlen!A25","v":0},{"$f":"Hehlen!B25","v":""},{"$f":"Hehlen!AB25","v":0},null,7]
[{"$f":"IF(D49=0,F49*10+1,RANK(D49,D$12:D$91,0))","v":71},{"$f":"Hehlen!A27","v":0},{"$f":"Hehlen!B27","v":""},{"$f":"Hehlen!AB27","v":0},null,7]
[{"$f":"IF(D50=0,F50*10+1,RANK(D50,D$12:D$91,0))","v":71},{"$f":"'TG Oker SZ 2'!A21","v":0},{"$f":"'TG Oker SZ 2'!B21","v":""},{"$f":"'TG Oker SZ 2'!AB21","v":0},null,7]
[{"$f":"IF(D51=0,F51*10+1,RANK(D51,D$12:D$91,0))","v":71},{"$f":"'TG Oker SZ 2'!A23","v":0},{"$f":"'TG Oker SZ 2'!B23","v":""},{"$f":"'TG Oker SZ 2'!AB23","v":0},null,7]
[{"$f":"IF(D52=0,F52*10+1,RANK(D52,D$12:D$91,0))","v":71},{"$f":"'TG Oker SZ 2'!A25","v":0},{"$f":"'TG Oker SZ 2'!B25","v":""},{"$f":"'TG Oker SZ 2'!AB25","v":0},null,7]
[{"$f":"IF(D53=0,F53*10+1,RANK(D53,D$12:D$91,0))","v":71},{"$f":"'TG Oker SZ 2'!A27","v":0},{"$f":"'TG Oker SZ 2'!B27","v":""},{"$f":"'TG Oker SZ 2'!AB27","v":0},null,7]
[{"$f":"IF(D54=0,F54*10+1,RANK(D54,D$12:D$91,0))","v":71},{"$f":"'Einbeck 1'!A27","v":0},{"$f":"'Einbeck 1'!B27","v":""},{"$f":"'Einbeck 1'!AB27","v":0},null,7]
[{"$f":"IF(D55=0,F55*10+1,RANK(D55,D$12:D$91,0))","v":71},{"$f":"'TG Hehlen Dielmissen'!A27","v":0},{"$f":"'TG Hehlen Dielmissen'!B27","v":""},{"$f":"'TG Hehlen Dielmissen'!AB27","v":0},null,7]
[{"$f":"IF(D56=0,F56*10+1,RANK(D56,D$12:D$91,0))","v":71},{"$f":"'TG Oker SZ 1'!A27","v":0},{"$f":"'TG Oker SZ 1'!B27","v":""},{"$f":"'TG Oker SZ 1'!AB27","v":0},null,7]
[{"$f":"IF(D57=0,F57*10+1,RANK(D57,D$12:D$91,0))","v":71},{"$f":"'Einbeck 2'!A19","v":0},{"$f":"'Einbeck 2'!B19","v":""},{"$f":"'Einbeck 2'!AB19","v":0},null,7]
[{"$f":"IF(D58=0,F58*10+1,RANK(D58,D$12:D$91,0))","v":71},{"$f":"'M8'!A19","v":0},{"$f":"'M8'!B19","v":""},{"$f":"'M8'!AB19","v":0},null,7]
[{"$f":"IF(D59=0,F59*10+1,RANK(D59,D$12:D$91,0))","v":71},{"$f":"'Einbeck 2'!A25","v":0},{"$f":"'Einbeck 2'!B25","v":""},{"$f":"'Einbeck 2'!AB25","v":0},null,7]
[{"$f":"IF(D60=0,F60*10+1,RANK(D60,D$12:D$91,0))","v":71},{"$f":"'M8'!A17","v":0},{"$f":"'M8'!B17","v":""},{"$f":"'M8'!AB17","v":0},null,7]
[{"$f":"IF(D61=0,F61*10+1,RANK(D61,D$12:D$91,0))","v":71},{"$f":"'TG Oker SZ 1'!A25","v":0},{"$f":"'TG Oker SZ 1'!B25","v":""},{"$f":"'TG Oker SZ 1'!AB25","v":0},null,7]
[{"$f":"IF(D62=0,F62*10+1,RANK(D62,D$12:D$91,0))","v":71},{"$f":"'TG Hehlen Dielmissen'!A23","v":0},{"$f":"'TG Hehlen Dielmissen'!B23","v":""},{"$f":"'TG Hehlen Dielmissen'!AB23","v":0},null,7]
[{"$f":"IF(D63=0,F63*10+1,RANK(D63,D$12:D$91,0))","v":71},{"$f":"Boffzen!A19","v":0},{"$f":"Boffzen!B19","v":""},{"$f":"Boffzen!AB19","v":0},null,7]
[{"$f":"IF(D64=0,F64*10+1,RANK(D64,D$12:D$91,0))","v":71},{"$f":"'M8'!A23","v":0},{"$f":"'M8'!B23","v":""},{"$f":"'M8'!AB23","v":0},null,7]
[{"$f":"IF(D65=0,F65*10+1,RANK(D65,D$12:D$91,0))","v":71},{"$f":"Boffzen!A23","v":0},{"$f":"Boffzen!B23","v":""},{"$f":"Boffzen!AB23","v":0},null,7]
[{"$f":"IF(D66=0,F66*10+1,RANK(D66,D$12:D$91,0))","v":71},{"$f":"'M8'!A13","v":0},{"$f":"'M8'!B13","v":""},{"$f":"'M8'!AB13","v":0},null,7]
[{"$f":"IF(D67=0,F67*10+1,RANK(D67,D$12:D$91,0))","v":71},{"$f":"'M8'!A21","v":0},{"$f":"'M8'!B21","v":""},{"$f":"'M8'!AB21","v":0},null,7]
[{"$f":"IF(D68=0,F68*10+1,RANK(D68,D$12:D$91,0))","v":71},{"$f":"'M8'!A15","v":0},{"$f":"'M8'!B15","v":""},{"$f":"'M8'!AB15","v":0},null,7]
[{"$f":"IF(D69=0,F69*10+1,RANK(D69,D$12:D$91,0))","v":71},{"$f":"'M8'!A11","v":0},{"$f":"'M8'!B11","v":""},{"$f":"'M8'!AB11","v":0},null,7]
[{"$f":"IF(D70=0,F70*10+1,RANK(D70,D$12:D$91,0))","v":71},{"$f":"'Einbeck 2'!A27","v":0},{"$f":"'Einbeck 2'!B27","v":""},{"$f":"'Einbeck 2'!AB27","v":0},null,7]
[{"$f":"IF(D71=0,F71*10+1,RANK(D71,D$12:D$91,0))","v":71},{"$f":"'TG Hehlen Dielmissen'!A25","v":0},{"$f":"'TG Hehlen Dielmissen'!B25","v":""},{"$f":"'TG Hehlen Dielmissen'!AB25","v":0},null,7]
[{"$f":"IF(D72=0,F72*10+1,RANK(D72,D$12:D$91,0))","v":71},{"$f":"'M8'!A25","v":0},{"$f":"'M8'!B25","v":""},{"$f":"'M8'!AB25","v":0},null,7]
[{"$f":"IF(D73=0,F73*10+1,RANK(D73,D$12:D$91,0))","v":71},{"$f":"'M8'!A27","v":0},{"$f":"'M8'!B27","v":""},{"$f":"'M8'!AB27","v":0},null,7]
[{"$f":"IF(D74=0,F74*10+1,RANK(D74,D$12:D$91,0))","v":71},{"$f":"'M8'!A9","v":0},{"$f":"'M8'!B9","v":"M8"},{"$f":"'M8'!AB9","v":0},null,7]
[{"$f":"IF(D75=0,F75*10+1,RANK(D75,D$12:D$91,0))","v":71},{"$f":"'Einbeck 2'!A23","v":0},{"$f":"'Einbeck 2'!B23","v":""},{"$f":"'Einbeck 2'!AB23","v":0},null,7]
[{"$f":"IF(D76=0,F76*10+1,RANK(D76,D$12:D$91,0))","v":71},{"$f":"'TG Oker SZ 1'!A23","v":0},{"$f":"'TG Oker SZ 1'!B23","v":""},{"$f":"'TG Oker SZ 1'!AB23","v":0},null,7]
[{"$f":"IF(D77=0,F77*10+1,RANK(D77,D$12:D$91,0))","v":71},{"$f":"'Einbeck 2'!A21","v":0},{"$f":"'Einbeck 2'!B21","v":""},{"$f":"'Einbeck 2'!AB21","v":0},null,7]
[{"$f":"IF(D78=0,F78*10+1,RANK(D78,D$12:D$91,0))","v":71},{"$f":"Boffzen!A21","v":0},{"$f":"Boffzen!B21","v":""},{"$f":"Boffzen!AB21","v":0},null,{"$f":"F77","v":7}]
[{"$f":"IF(D79=0,F79*10+1,RANK(D79,D$12:D$91,0))","v":71},{"$f":"'TG Oker SZ 2'!A19","v":0},{"$f":"'TG Oker SZ 2'!B19","v":""},{"$f":"'TG Oker SZ 2'!AB19","v":0},null,7]
[{"$f":"IF(D80=0,F80*10+1,RANK(D80,D$12:D$91,0))","v":71},{"$f":"'Einbeck 1'!A21","v":"Dins Kozlovskis"},{"$f":"'Einbeck 1'!B21","v":"Einbecker SV 1"},{"$f":"'Einbeck 1'!AB21","v":0},null,7]
[{"$f":"IF(D81=0,F81*10+1,RANK(D81,D$12:D$91,0))","v":71},{"$f":"'Einbeck 1'!A13","v":"Dominic Kobben"},{"$f":"'Einbeck 1'!B13","v":"Einbecker SV 1"},{"$f":"'Einbeck 1'!AB13","v":0},null,7]
[{"$f":"IF(D82=0,F82*10+1,RANK(D82,D$12:D$91,0))","v":71},{"$f":"Boffzen!A9","v":"Erik Komnick"},{"$f":"Boffzen!B9","v":"MTV Boffzen"},{"$f":"Boffzen!AB9","v":0},null,7]
[{"$f":"IF(D83=0,F83*10+1,RANK(D83,D$12:D$91,0))","v":71},{"$f":"'Einbeck 1'!A11","v":"Eugen Dahl"},{"$f":"'Einbeck 1'!B11","v":"Einbecker SV 1"},{"$f":"'Einbeck 1'!AB11","v":0},null,7]
[{"$f":"IF(D84=0,F84*10+1,RANK(D84,D$12:D$91,0))","v":71},{"$f":"'Einbeck 1'!A15","v":"Illes Törjek"},{"$f":"'Einbeck 1'!B15","v":"Einbecker SV 1"},{"$f":"'Einbeck 1'!AB15","v":0},null,7]
[{"$f":"IF(D85=0,F85*10+1,RANK(D85,D$12:D$91,0))","v":71},{"$f":"'TG Hehlen Dielmissen'!A15","v":"Jakob Kammel"},{"$f":"'TG Hehlen Dielmissen'!B15","v":"TG Hehlen Dielmissen"},{"$f":"'TG Hehlen Dielmissen'!AB15","v":0},null,7]
[{"$f":"IF(D86=0,F86*10+1,RANK(D86,D$12:D$91,0))","v":71},{"$f":"'TG Oker SZ 1'!A19","v":"Jannis Volkmer"},{"$f":"'TG Oker SZ 1'!B19","v":"TG Oker Salzgitter 1"},{"$f":"'TG Oker SZ 1'!AB19","v":0},null,7]
[{"$f":"IF(D87=0,F87*10+1,RANK(D87,D$12:D$91,0))","v":71},{"$f":"'TG Hehlen Dielmissen'!A17","v":"Luca Puls"},{"$f":"'TG Hehlen Dielmissen'!B17","v":"TG Hehlen Dielmissen"},{"$f":"'TG Hehlen Dielmissen'!AB17","v":0},null,7]
[{"$f":"IF(D88=0,F88*10+1,RANK(D88,D$12:D$91,0))","v":71},{"$f":"'Einbeck 1'!A19","v":"Nicolas Buchholz"},{"$f":"'Einbeck 1'!B19","v":"Einbecker SV 1"},{"$f":"'Einbeck 1'!AB19","v":0},null,7]
[{"$f":"IF(D89=0,F89*10+1,RANK(D89,D$12:D$91,0))","v":71},{"$f":"Hehlen!A9","v":"Paul Bähr"},{"$f":"Hehlen!B9","v":"TC Jahn Hehlen"},{"$f":"Hehlen!AB9","v":0},null,7]
[{"$f":"IF(D90=0,F90*10+1,RANK(D90,D$12:D$91,0))","v":71},{"$f":"'TG Hehlen Dielmissen'!A21","v":"Timm Zuchold"},{"$f":"'TG Hehlen Dielmissen'!B21","v":"TG Hehlen Dielmissen"},{"$f":"'TG Hehlen Dielmissen'!AB21","v":0},null,7]
[{"$f":"IF(D91=0,F91*10+1,RANK(D91,D$12:D$91,0))","v":71},{"$f":"Hehlen!A21","v":"Tom Weper"},{"$f":"Hehlen!B21","v":"TC Jahn Hehlen"},{"$f":"Hehlen!AB21","v":0},null,7]

{"sheet":"Startreihenfolge","index":2,"n_rows":88,"n_cols":6,"rows_kept":88,"cut":false,"hidden":true,"merged":[]}
[]
[null,"1. Runde"]
[]
[null,"Boden",null,"Pauschenpferd",null,"Ringe"]
[]
[null,{"$f":"Ergebnisse!J40","v":"Einbecker SV 2"},null,{"$f":"Ergebnisse!J42","v":"TC Jahn Hehlen"},null,{"$f":"Ergebnisse!J44","v":"TG Oker Salzgitter 2"}]
[null,{"$f":"Ergebnisse!J41","v":"TG Oker Salzgitter 1"},null,{"$f":"Ergebnisse!J43","v":"MTV Boffzen"},null,{"$f":"Ergebnisse!J45","v":"Einbecker SV 1"}]
[]
[]
[null,"Sprung",null,"Barren",null,"Reck"]
[]
[null,"TV Kleefeld 1",null,"SC Melle",null,"TG Braunschweig -Hondelage"]
[null,"1860 Bremen",null,"TG Oker Salzgitter 2",null,"TG Rinteln - Hehlen 1"]
[]
[]
[]
[null,"2. Runde"]
[]
[null,"Boden",null,"Pauschenpferd",null,"Ringe"]
[]
[null,{"$f":"F7","v":"Einbecker SV 1"},null,{"$f":"B7","v":"TG Oker Salzgitter 1"},null,{"$f":"D7","v":"MTV Boffzen"}]
[null,{"$f":"F6","v":"TG Oker Salzgitter 2"},null,{"$f":"B6","v":"Einbecker SV 2"},null,{"$f":"D6","v":"TC Jahn Hehlen"}]
[]
[]
[null,"Sprung",null,"Barren",null,"Reck"]
[]
[null,{"$f":"F13","v":"TG Rinteln - Hehlen 1"},null,{"$f":"B13","v":"1860 Bremen"},null,{"$f":"D13","v":"TG Oker Salzgitter 2"}]
[null,{"$f":"F12","v":"TG Braunschweig -Hondelage"},null,{"$f":"B12","v":"TV Kleefeld 1"},null,{"$f":"D12","v":"SC Melle"}]
[]
[]
[]
[null,"3. Runde"]
[]
[null,"Boden",null,"Pauschenpferd",null,"Ringe"]
[]
[null,{"$f":"F22","v":"TC Jahn Hehlen"},null,{"$f":"B22","v":"TG Oker Salzgitter 2"},null,{"$f":"D22","v":"Einbecker SV 2"}]
[null,{"$f":"F21","v":"MTV Boffzen"},null,{"$f":"B21","v":"Einbecker SV 1"},null,{"$f":"D21","v":"TG Oker Salzgitter 1"}]
[]
[]
[null,"Sprung",null,"Barren",null,"Reck"]
[]
[null,{"$f":"F28","v":"SC Melle"},null,{"$f":"B28","v":"TG Braunschweig -Hondelage"},null,{"$f":"D28","v":"TV Kleefeld 1"}]
[null,{"$f":"F27","v":"TG Oker Salzgitter 2"},null,{"$f":"B27","v":"TG Rinteln - Hehlen 1"},null,{"$f":"D27","v":"1860 Bremen"}]
[]
[]
[]
[null,"4. Runde"]
[]
[null,"Boden",null,"Pauschenpferd",null,"Ringe"]
[]
[null,{"$f":"F43","v":"1860 Bremen"},null,{"$f":"B43","v":"TG Oker Salzgitter 2"},null,{"$f":"D43","v":"TG Rinteln - Hehlen 1"}]
[null,{"$f":"F42","v":"TV Kleefeld 1"},null,{"$f":"B42","v":"SC Melle"},null,{"$f":"D42","v":"TG Braunschweig -Hondelage"}]
[]
[]
[null,"Sprung",null,"Barren",null,"Reck"]
[]
[null,{"$f":"F37","v":"TG Oker Salzgitter 1"},null,{"$f":"B37","v":"MTV Boffzen"},null,{"$f":"D37","v":"Einbecker SV 1"}]
[null,{"$f":"F36","v":"Einbecker SV 2"},null,{"$f":"B36","v":"TC Jahn Hehlen"},null,{"$f":"D36","v":"TG Oker Salzgitter 2"}]
[]
[]
[]
[null,"5. Runde"]
[]
[null,"Boden",null,"Pauschenpferd",null,"Ringe"]
[]
[null,{"$f":"F52","v":"TG Braunschweig -Hondelage"},null,{"$f":"B52","v":"TV Kleefeld 1"},null,{"$f":"D52","v":"SC Melle"}]
[null,{"$f":"F51","v":"TG Rinteln - Hehlen 1"},null,{"$f":"B51","v":"1860 Bremen"},null,{"$f":"D51","v":"TG Oker Salzgitter 2"}]
[]
[]
[null,"Sprung",null,"Barren",null,"Reck"]
[]
[null,{"$f":"F58","v":"TG Oker Salzgitter 2"},null,{"$f":"B58","v":"Einbecker SV 2"},null,{"$f":"D58","v":"TC Jahn Hehlen"}]
[null,{"$f":"F57","v":"Einbecker SV 1"},null,{"$f":"B57","v":"TG Oker Salzgitter 1"},null,{"$f":"D57","v":"MTV Boffzen"}]
[]
[]
[]
[null,"6. Runde"]
[]
[null,"Boden",null,"Pauschenpferd",null,"Ringe"]
[]
[null,{"$f":"F67","v":"TG Oker Salzgitter 2"},null,{"$f":"B67","v":"TG Rinteln - Hehlen 1"},null,{"$f":"D67","v":"1860 Bremen"}]
[null,{"$f":"F66","v":"SC Melle"},null,{"$f":"B66","v":"TG Braunschweig -Hondelage"},null,{"$f":"D66","v":"TV Kleefeld 1"}]
[]
[]
[null,"Sprung",null,"Barren",null,"Reck"]
[]
[null,{"$f":"F73","v":"MTV Boffzen"},null,{"$f":"B73","v":"Einbecker SV 1"},null,{"$f":"D73","v":"TG Oker Salzgitter 1"}]
[null,{"$f":"F72","v":"TC Jahn Hehlen"},null,{"$f":"B72","v":"TG Oker Salzgitter 2"},null,{"$f":"D72","v":"Einbecker SV 2"}]

{"sheet":"Formeln","index":3,"n_rows":42,"n_cols":15,"rows_kept":42,"cut":false,"hidden":false,"merged":[]}
[]
[]
["Gesamt",null,null,null,null,null,"Gesamt 1. WK"]
[null,"Punkte","Platz","WK Punkte","Gerät Punkt",null,null,"Platz","WK Punkte","Gerät Punkt","Punkte","Rang WK","Rang Geräte","Rang Punkte","Hilfsliste"]
["MTV Boffzen",{"$f":"Boffzen!AB$30","v":240.35000000000002},{"$f":"IF(B5=0,'INFO Blatt'!B$3+1,RANK(B5,B$5:B$14,0))","v":4},{"$f":"IF('INFO Blatt'!B$3<6,14-C5*2,'INFO Blatt'!B$3*2+2-C5*2)","v":8},{"$f":"SUM(D20,I20,N20,D33,I33,N33)","v":40},null,{"$f":"A5","v":"MTV Boffzen"},{"$f":"IF(K5=0,'INFO Blatt'!B$3+1,RANK(O5,O$5:O$14,1))","v":4},{"$f":"D5+[1]Formeln!$I5","v":26},{"$f":"E5+[1]Formeln!$J5","v":140},{"$f":"B5+[1]Formeln!$K5","v":736.6},{"$f":"RANK(I5,I5:I14,0)","v":4},{"$f":"RANK(J5,J5:J14,0)","v":4},{"$f":"RANK(K5,K$5:K$14,0)","v":4},{"$f":"L5+(M5/10)+(N5/100)","v":4.4400000000000004}]
["TC Jahn Hehlen",{"$f":"Hehlen!AB$30","v":261.8},{"$f":"IF(B6=0,'INFO Blatt'!B$3+1,RANK(B6,B$5:B$14,0))","v":3},{"$f":"IF('INFO Blatt'!B$3<6,14-C6*2,'INFO Blatt'!B$3*2+2-C6*2)","v":10},66,null,{"$f":"A6","v":"TC Jahn Hehlen"},{"$f":"IF(K6=0,'INFO Blatt'!B$3+1,RANK(O6,O$5:O$14,1))","v":3},{"$f":"D6+[1]Formeln!$I6","v":34},{"$f":"E6+[1]Formeln!$J6","v":216},{"$f":"B6+[1]Formeln!$K6","v":790.45},{"$f":"RANK(I6,I5:I14,0)","v":3},{"$f":"RANK(J6,J5:J14,0)","v":1},{"$f":"RANK(K6,K$5:K$14,0)","v":2},{"$f":"L6+(M6/10)+(N6/100)","v":3.12}]
["TG Oker Salzgitter 1",{"$f":"'TG Oker SZ 1'!AB$30","v":270.35000000000002},{"$f":"IF(B7=0,'INFO Blatt'!B$3+1,RANK(B7,B$5:B$14,0))","v":1},{"$f":"IF('INFO Blatt'!B$3<6,14-C7*2,'INFO Blatt'!B$3*2+2-C7*2)","v":14},78,null,"TG Oker Salzgitter 1",{"$f":"IF(K7=0,'INFO Blatt'!B$3+1,RANK(O7,O$5:O$14,1))","v":2},{"$f":"D7+[1]Formeln!$I7","v":36},{"$f":"E7+[1]Formeln!$J7","v":198},{"$f":"B7+[1]Formeln!$K7","v":782.69500000000005},{"$f":"RANK(I7,I5:I14,0)","v":1},{"$f":"RANK(J7,J5:J14,0)","v":3},3,1.33]
["TG Oker Salzgitter 2",{"$f":"'TG Oker SZ 2'!AB$30","v":232.05},{"$f":"IF(B8=0,'INFO Blatt'!B$3+1,RANK(B8,B$5:B$14,0))","v":5},{"$f":"IF('INFO Blatt'!B$3<6,14-C8*2,'INFO Blatt'!B$3*2+2-C8*2)","v":6},30,null,"TG Oker Salzgitter 2",{"$f":"IF(K8=0,'INFO Blatt'!B$3+1,RANK(O8,O$5:O$14,1))","v":5},{"$f":"D8+[1]Formeln!$I8","v":16},{"$f":"E8+[1]Formeln!$J8","v":96},{"$f":"B8+[1]Formeln!$K8","v":703.25},{"$f":"RANK(I8,I5:I14,0)","v":5},{"$f":"RANK(J8,J5:J14,0)","v":5},5,5.55]
["Einbecker SV 1",{"$f":"'Einbeck 1'!AB$30","v":216.29999999999998},{"$f":"IF(B9=0,'INFO Blatt'!B$3+1,RANK(B9,B$5:B$14,0))","v":7},{"$f":"IF('INFO Blatt'!B$3<6,14-C9*2,'INFO Blatt'!B$3*2+2-C9*2)","v":2},18,null,"Einbecker SV 1",{"$f":"IF(K9=0,'INFO Blatt'!B$3+1,RANK(O9,O$5:O$14,1))","v":6},{"$f":"D9+[1]Formeln!$I9","v":12},{"$f":"E9+[1]Formeln!$J9","v":78},{"$f":"B9+[1]Formeln!$K9","v":686.84999999999991},{"$f":"RANK(I9,I5:I14,0)","v":6},{"$f":"RANK(J9,J5:J14,0)","v":6},7,6.67]
["Einbecker SV 2",{"$f":"'Einbeck 2'!AB$30","v":268.54999999999995},{"$f":"IF(B10=0,'INFO Blatt'!B$3+1,RANK(B10,B$5:B$14,0))","v":2},{"$f":"IF('INFO Blatt'!B$3<6,14-C10*2,'INFO Blatt'!B$3*2+2-C10*2)","v":12},72,null,"Einbecker SV 2",{"$f":"IF(K10=0,'INFO Blatt'!B$3+1,RANK(O10,O$5:O$14,1))","v":1},{"$f":"D10+[1]Formeln!$I10","v":36},{"$f":"E10+[1]Formeln!$J10","v":210},{"$f":"B10+[1]Formeln!$K10","v":794.09999999999991},{"$f":"RANK(I10,I5:I14,0)","v":1},{"$f":"RANK(J10,J5:J14,0)","v":2},1,1.21]
["TG Hehlen Dielmissen",{"$f":"'TG Hehlen Dielmissen'!AB$30","v":228.60000000000002},{"$f":"IF(B11=0,'INFO Blatt'!B$3+1,RANK(B11,B$5:B$14,0))","v":6},{"$f":"IF('INFO Blatt'!B$3<6,14-C11*2,'INFO Blatt'!B$3*2+2-C11*2)","v":4},32,null,"TG Hehlen Dielmissen",{"$f":"IF(K11=0,'INFO Blatt'!B$3+1,RANK(O11,O$5:O$14,1))","v":7},{"$f":"D11+[1]Formeln!$I11","v":8},{"$f":"E11+[1]Formeln!$J11","v":72},{"$f":"B11+[1]Formeln!$K11","v":688.05000000000007},{"$f":"RANK(I11,I5:I14,0)","v":7},{"$f":"RANK(J11,J5:J14,0)","v":7},6,7.76]
["M8",{"$f":"'M8'!AB$30","v":0},{"$f":"IF(B12=0,'INFO Blatt'!B$3+1,RANK(B12,B$5:B$14,0))","v":8},{"$f":"IF('INFO Blatt'!B$3<6,14-C12*2,'INFO Blatt'!B$3*2+2-C12*2)","v":0},0,null,"M8",{"$f":"IF(K12=0,'INFO Blatt'!B$3+1,RANK(O12,O$5:O$14,1))","v":8},{"$f":"D12+[1]Formeln!$I12","v":0},{"$f":"E12+[1]Formeln!$J12","v":0},{"$f":"B12+[1]Formeln!$K12","v":0},{"$f":"RANK(I12,I5:I14,0)","v":8},{"$f":"RANK(J12,J5:J14,0)","v":8},8,8.8800000000000008]
["M9",{"$f":"'M9'!AB$30","v":0},{"$f":"IF(B13=0,'INFO Blatt'!B$3+1,RANK(B13,B$5:B$14,0))","v":8},{"$f":"IF('INFO Blatt'!B$3<6,14-C13*2,'INFO Blatt'!B$3*2+2-C13*2)","v":0},0,null,"M9",{"$f":"IF(K13=0,'INFO Blatt'!B$3+1,RANK(O13,O$5:O$14,1))","v":8},{"$f":"D13+[1]Formeln!$I13","v":0},{"$f":"E13+[1]Formeln!$J13","v":0},{"$f":"B13+[1]Formeln!$K13","v":0},{"$f":"RANK(I13,I5:I14,0)","v":8},{"$f":"RANK(J13,J5:J14,0)","v":8},8,8.8800000000000008]
["M10",{"$f":"'M10'!AB$30","v":0},{"$f":"IF(B14=0,'INFO Blatt'!B$3+1,RANK(B14,B$5:B$14,0))","v":8},{"$f":"IF('INFO Blatt'!B$3<6,14-C14*2,'INFO Blatt'!B$3*2+2-C14*2)","v":0},0,null,"M10",{"$f":"IF(K14=0,'INFO Blatt'!B$3+1,RANK(O14,O$5:O$14,1))","v":8},{"$f":"D14+[1]Formeln!$I14","v":0},{"$f":"E14+[1]Formeln!$J14","v":0},{"$f":"B14+[1]Formeln!$K14","v":0},{"$f":"RANK(I14,I5:I14,0)","v":8},{"$f":"RANK(J14,J5:J14,0)","v":8},8,8.8800000000000008]
[]
["Gerätepunkte"]
[]
["Boden",null,null,null,null,"Pferd",null,null,null,null,"Ringe"]
[null,"Punkte","Platz","Gerät Punkt",null,null,"Punkte","Platz","Gerät Punkt",null,null,"Punkte","Platz","Gerät Punkt"]
[{"$f":"A5","v":"MTV Boffzen"},{"$f":"ROUND(Boffzen!$G$30,2)","v":40.9},{"$f":"IF(B20=0,,RANK(B20,B$20:B$29,0))","v":5},{"$f":"IF(C20=0,,IF('INFO Blatt'!B$3<6,14-C20*2,'INFO Blatt'!B$3*2+2-C20*2))","v":6},null,{"$f":"A5","v":"MTV Boffzen"},{"$f":"ROUND(Boffzen!$K$30,2)","v":40},{"$f":"IF(G20=0,,RANK(G20,G$20:G$29,0))","v":4},{"$f":"IF(H20=0,,IF('INFO Blatt'!B$3<6,14-H20*2,'INFO Blatt'!B$3*2+2-H20*2))","v":8},null,{"$f":"A5","v":"MTV Boffzen"},{"$f":"ROUND(Boffzen!$O$30,2)","v":40.049999999999997},{"$f":"IF(L20=0,,RANK(L20,L$20:L$29,0))","v":4},{"$f":"IF(M20=0,,IF('INFO Blatt'!B$3<6,14-M20*2,'INFO Blatt'!B$3*2+2-M20*2))","v":8}]
["TC Jahn Hehlen",{"$f":"ROUND(Hehlen!G30,2)","v":44.05},3,{"$f":"IF(C21=0,,IF('INFO Blatt'!B$3<6,14-C21*2,'INFO Blatt'!B$3*2+2-C21*2))","v":10},null,"TC Jahn Hehlen",{"$f":"ROUND(Hehlen!K30,2)","v":40.85},3,{"$f":"IF(H21=0,,IF('INFO Blatt'!B$3<6,14-H21*2,'INFO Blatt'!B$3*2+2-H21*2))","v":10},null,"TC Jahn Hehlen",{"$f":"ROUND(Hehlen!O30,2)","v":46.9},{"$f":"IF(L21=0,,RANK(L21,L$20:L$29,0))","v":1},{"$f":"IF(M21=0,,IF('INFO Blatt'!B$3<6,14-M21*2,'INFO Blatt'!B$3*2+2-M21*2))","v":14}]
["TG Oker Salzgitter 1",{"$f":"ROUND('TG Oker SZ 1'!$G$30,2)","v":44.5},2,{"$f":"IF(C22=0,,IF('INFO Blatt'!B$3<6,14-C22*2,'INFO Blatt'!B$3*2+2-C22*2))","v":12},null,"TG Oker Salzgitter 1",{"$f":"ROUND('TG Oker SZ 1'!$K$30,2)","v":45.8},1,{"$f":"IF(H22=0,,IF('INFO Blatt'!B$3<6,14-H22*2,'INFO Blatt'!B$3*2+2-H22*2))","v":14},null,{"$f":"A7","v":"TG Oker Salzgitter 1"},{"$f":"ROUND('TG Oker SZ 1'!$O$30,2)","v":45.5},3,{"$f":"IF(M22=0,,IF('INFO Blatt'!B$3<6,14-M22*2,'INFO Blatt'!B$3*2+2-M22*2))","v":10}]
["TG Oker Salzgitter 2",{"$f":"ROUND('TG Oker SZ 2'!$G$30,2)","v":38.200000000000003},7,{"$f":"IF(C23=0,,IF('INFO Blatt'!B$3<6,14-C23*2,'INFO Blatt'!B$3*2+2-C23*2))","v":2},null,"TG Oker Salzgitter 2",{"$f":"ROUND('TG Oker SZ 2'!$K$30,2)","v":35.65},6,{"$f":"IF(H23=0,,IF('INFO Blatt'!B$3<6,14-H23*2,'INFO Blatt'!B$3*2+2-H23*2))","v":4},null,"TG Oker Salzgitter 2",{"$f":"ROUND('TG Oker SZ 2'!$O$30,2)","v":36.700000000000003},6,{"$f":"IF(M23=0,,IF('INFO Blatt'!B$3<6,14-M23*2,'INFO Blatt'!B$3*2+2-M23*2))","v":4}]
["Einbecker SV 1",{"$f":"ROUND('Einbeck 1'!$G$30,2)","v":38.9},6,{"$f":"IF(C24=0,,IF('INFO Blatt'!B$3<6,14-C24*2,'INFO Blatt'!B$3*2+2-C24*2))","v":4},null,"Einbecker SV 1",{"$f":"ROUND('Einbeck 1'!$K$30,2)","v":30.3},7,{"$f":"IF(H24=0,,IF('INFO Blatt'!B$3<6,14-H24*2,'INFO Blatt'!B$3*2+2-H24*2))","v":2},null,"Einbecker SV 1",{"$f":"ROUND('Einbeck 1'!$O$30,2)","v":33.9},7,{"$f":"IF(M24=0,,IF('INFO Blatt'!B$3<6,14-M24*2,'INFO Blatt'!B$3*2+2-M24*2))","v":2}]
["Einbecker SV 2",{"$f":"ROUND('Einbeck 2'!$G$30,2)","v":47.35},1,{"$f":"IF(C25=0,,IF('INFO Blatt'!B$3<6,14-C25*2,'INFO Blatt'!B$3*2+2-C25*2))","v":14},null,"Einbecker SV 2",{"$f":"ROUND('Einbeck 2'!$K$30,2)","v":43.1},2,{"$f":"IF(H25=0,,IF('INFO Blatt'!B$3<6,14-H25*2,'INFO Blatt'!B$3*2+2-H25*2))","v":12},null,"Einbecker SV 2",{"$f":"ROUND('Einbeck 2'!$O$30,2)","v":46.2},2,{"$f":"IF(M25=0,,IF('INFO Blatt'!B$3<6,14-M25*2,'INFO Blatt'!B$3*2+2-M25*2))","v":12}]
["TG Hehlen Dielmissen",{"$f":"ROUND('TG Hehlen Dielmissen'!G30,2)","v":41.1},4,{"$f":"IF(C26=0,,IF('INFO Blatt'!B$3<6,14-C26*2,'INFO Blatt'!B$3*2+2-C26*2))","v":8},null,"TG Hehlen Dielmissen",{"$f":"ROUND('TG Hehlen Dielmissen'!K30,2)","v":36.4},5,{"$f":"IF(H26=0,,IF('INFO Blatt'!B$3<6,14-H26*2,'INFO Blatt'!B$3*2+2-H26*2))","v":6},null,"TG Hehlen Dielmissen",{"$f":"ROUND('TG Hehlen Dielmissen'!O30,2)","v":38.1},{"$f":"IF(L26=0,,RANK(L26,L$20:L$29,0))","v":5},{"$f":"IF(M26=0,,IF('INFO Blatt'!B$3<6,14-M26*2,'INFO Blatt'!B$3*2+2-M26*2))","v":6}]
["M8",{"$f":"'M8'!$G$30","v":0},0,{"$f":"IF(C27=0,,IF('INFO Blatt'!B$3<6,14-C27*2,'INFO Blatt'!B$3*2+2-C27*2))","v":0},null,"M8",{"$f":"'M8'!K$30","v":0},0,{"$f":"IF(H27=0,,IF('INFO Blatt'!B$3<6,14-H27*2,'INFO Blatt'!B$3*2+2-H27*2))","v":0},null,"M8",{"$f":"'M8'!O$30","v":0},0,{"$f":"IF(M27=0,,IF('INFO Blatt'!B$3<6,14-M27*2,'INFO Blatt'!B$3*2+2-M27*2))","v":0}]
["M9",{"$f":"'M9'!$G$30","v":0},0,{"$f":"IF(C28=0,,IF('INFO Blatt'!B$3<6,14-C28*2,'INFO Blatt'!B$3*2+2-C28*2))","v":0},null,"M9",{"$f":"'M9'!K$30","v":0},0,{"$f":"IF(H28=0,,IF('INFO Blatt'!B$3<6,14-H28*2,'INFO Blatt'!B$3*2+2-H28*2))","v":0},null,"M9",{"$f":"'M9'!O$30","v":0},0,{"$f":"IF(M28=0,,IF('INFO Blatt'!B$3<6,14-M28*2,'INFO Blatt'!B$3*2+2-M28*2))","v":0}]
["M10",{"$f":"'M10'!$G$30","v":0},0,{"$f":"IF(C29=0,,IF('INFO Blatt'!B$3<6,14-C29*2,'INFO Blatt'!B$3*2+2-C29*2))","v":0},null,"M10",{"$f":"'M10'!K$30","v":0},0,{"$f":"IF(H29=0,,IF('INFO Blatt'!B$3<6,14-H29*2,'INFO Blatt'!B$3*2+2-H29*2))","v":0},null,"M10",{"$f":"'M10'!O$30","v":0},0,{"$f":"IF(M29=0,,IF('INFO Blatt'!B$3<6,14-M29*2,'INFO Blatt'!B$3*2+2-M29*2))","v":0}]
[]
["Sprung",null,null,null,null,"Barren",null,null,null,null,"Reck"]
[null,"Punkte","Platz","Gerät Punkt",null,null,"Punkte","Platz","Gerät Punkt",null,null,"Punkte","Platz","Gerät Punkt"]
[{"$f":"A5","v":"MTV Boffzen"},{"$f":"ROUND(Boffzen!$S$30,2)","v":40.6},{"$f":"IF(B33=0,,RANK(B33,B$33:B$42,0))","v":7},{"$f":"IF(C33=0,,IF('INFO Blatt'!B$3<6,14-C33*2,'INFO Blatt'!B$3*2+2-C33*2))","v":2},null,{"$f":"A5","v":"MTV Boffzen"},{"$f":"ROUND(Boffzen!$W$30,2)","v":40.299999999999997},{"$f":"IF(G33=0,,RANK(G33,G$33:G$42,0))","v":4},{"$f":"IF(H33=0,,IF('INFO Blatt'!B$3<6,14-H33*2,'INFO Blatt'!B$3*2+2-H33*2))","v":8},null,{"$f":"A5","v":"MTV Boffzen"},{"$f":"ROUND(Boffzen!$AA$30,2)","v":38.5},{"$f":"IF(L33=0,,RANK(L33,L$33:L$42,0))","v":4},{"$f":"IF(M33=0,,IF('INFO Blatt'!B$3<6,14-M33*2,'INFO Blatt'!B$3*2+2-M33*2))","v":8}]
["TC Jahn Hehlen",{"$f":"ROUND(Hehlen!S30,2)","v":45.2},2,{"$f":"IF(C34=0,,IF('INFO Blatt'!B$3<6,14-C34*2,'INFO Blatt'!B$3*2+2-C34*2))","v":12},null,"TC Jahn Hehlen",{"$f":"ROUND(Hehlen!W30,2)","v":42.35},3,{"$f":"IF(H34=0,,IF('INFO Blatt'!B$3<6,14-H34*2,'INFO Blatt'!B$3*2+2-H34*2))","v":10},null,"TC Jahn Hehlen",{"$f":"ROUND(Hehlen!AA30,2)","v":42.45},{"$f":"IF(L34=0,,RANK(L34,L$33:L$42,0))","v":3},{"$f":"IF(M34=0,,IF('INFO Blatt'!B$3<6,14-M34*2,'INFO Blatt'!B$3*2+2-M34*2))","v":10}]
["TG Oker Salzgitter 1",{"$f":"ROUND('TG Oker SZ 1'!$S$30,2)","v":46.8},1,{"$f":"IF(C35=0,,IF('INFO Blatt'!B$3<6,14-C35*2,'INFO Blatt'!B$3*2+2-C35*2))","v":14},null,"TG Oker Salzgitter 1",{"$f":"ROUND('TG Oker SZ 1'!$W$30,2)","v":44.65},1,{"$f":"IF(H35=0,,IF('INFO Blatt'!B$3<6,14-H35*2,'INFO Blatt'!B$3*2+2-H35*2))","v":14},null,"TG Oker Salzgitter 1",{"$f":"ROUND('TG Oker SZ 1'!$AA$30,2)","v":43.1},1,{"$f":"IF(M35=0,,IF('INFO Blatt'!B$3<6,14-M35*2,'INFO Blatt'!B$3*2+2-M35*2))","v":14}]
["TG Oker Salzgitter 2",{"$f":"ROUND('TG Oker SZ 2'!$S$30,2)","v":44.75},4,{"$f":"IF(C36=0,,IF('INFO Blatt'!B$3<6,14-C36*2,'INFO Blatt'!B$3*2+2-C36*2))","v":8},null,"TG Oker Salzgitter 2",{"$f":"ROUND('TG Oker SZ 2'!$W$30,2)","v":38.549999999999997},5,{"$f":"IF(H36=0,,IF('INFO Blatt'!B$3<6,14-H36*2,'INFO Blatt'!B$3*2+2-H36*2))","v":6},null,"TG Oker Salzgitter 2",{"$f":"ROUND('TG Oker SZ 2'!$AA$30,2)","v":38.200000000000003},5,{"$f":"IF(M36=0,,IF('INFO Blatt'!B$3<6,14-M36*2,'INFO Blatt'!B$3*2+2-M36*2))","v":6}]
["Einbecker SV 1",{"$f":"ROUND('Einbeck 1'!$S$30,2)","v":41.3},6,{"$f":"IF(C37=0,,IF('INFO Blatt'!B$3<6,14-C37*2,'INFO Blatt'!B$3*2+2-C37*2))","v":4},null,"Einbecker SV 1",{"$f":"ROUND('Einbeck 1'!$W$30,2)","v":36.299999999999997},6,{"$f":"IF(H37=0,,IF('INFO Blatt'!B$3<6,14-H37*2,'INFO Blatt'!B$3*2+2-H37*2))","v":4},null,"Einbecker SV 1",{"$f":"ROUND('Einbeck 1'!$AA$30,2)","v":35.6},7,{"$f":"IF(M37=0,,IF('INFO Blatt'!B$3<6,14-M37*2,'INFO Blatt'!B$3*2+2-M37*2))","v":2}]
["Einbecker SV 2",{"$f":"ROUND('Einbeck 2'!$S$30,2)","v":44.9},3,{"$f":"IF(C38=0,,IF('INFO Blatt'!B$3<6,14-C38*2,'INFO Blatt'!B$3*2+2-C38*2))","v":10},null,"Einbecker SV 2",{"$f":"ROUND('Einbeck 2'!$W$30,2)","v":44.1},2,{"$f":"IF(H38=0,,IF('INFO Blatt'!B$3<6,14-H38*2,'INFO Blatt'!B$3*2+2-H38*2))","v":12},null,"Einbecker SV 2",{"$f":"ROUND('Einbeck 2'!$AA$30,2)","v":42.9},2,{"$f":"IF(M38=0,,IF('INFO Blatt'!B$3<6,14-M38*2,'INFO Blatt'!B$3*2+2-M38*2))","v":12}]
["TG Hehlen Dielmissen",{"$f":"ROUND('TG Hehlen Dielmissen'!S30,2)","v":41.75},5,{"$f":"IF(C39=0,,IF('INFO Blatt'!B$3<6,14-C39*2,'INFO Blatt'!B$3*2+2-C39*2))","v":6},null,"TG Hehlen Dielmissen",{"$f":"ROUND('TG Hehlen Dielmissen'!W30,2)","v":33.700000000000003},7,{"$f":"IF(H39=0,,IF('INFO Blatt'!B$3<6,14-H39*2,'INFO Blatt'!B$3*2+2-H39*2))","v":2},null,"TG Hehlen Dielmissen",{"$f":"ROUND('TG Hehlen Dielmissen'!AA30,2)","v":37.549999999999997},{"$f":"IF(L39=0,,RANK(L39,L$33:L$42,0))","v":6},{"$f":"IF(M39=0,,IF('INFO Blatt'!B$3<6,14-M39*2,'INFO Blatt'!B$3*2+2-M39*2))","v":4}]
["M8",{"$f":"'M8'!S$30","v":0},0,{"$f":"IF(C40=0,,IF('INFO Blatt'!B$3<6,14-C40*2,'INFO Blatt'!B$3*2+2-C40*2))","v":0},null,"M8",{"$f":"'M8'!W$30","v":0},0,{"$f":"IF(H40=0,,IF('INFO Blatt'!B$3<6,14-H40*2,'INFO Blatt'!B$3*2+2-H40*2))","v":0},null,"M8",{"$f":"'M8'!AA$30","v":0},0,{"$f":"IF(M40=0,,IF('INFO Blatt'!B$3<6,14-M40*2,'INFO Blatt'!B$3*2+2-M40*2))","v":0}]
["M9",{"$f":"'M9'!S$30","v":0},0,{"$f":"IF(C41=0,,IF('INFO Blatt'!B$3<6,14-C41*2,'INFO Blatt'!B$3*2+2-C41*2))","v":0},null,"M9",{"$f":"'M9'!W$30","v":0},0,{"$f":"IF(H41=0,,IF('INFO Blatt'!B$3<6,14-H41*2,'INFO Blatt'!B$3*2+2-H41*2))","v":0},null,"M9",{"$f":"'M9'!AA$30","v":0},0,{"$f":"IF(M41=0,,IF('INFO Blatt'!B$3<6,14-M41*2,'INFO Blatt'!B$3*2+2-M41*2))","v":0}]
["M10",{"$f":"'M10'!S$30","v":0},0,{"$f":"IF(C42=0,,IF('INFO Blatt'!B$3<6,14-C42*2,'INFO Blatt'!B$3*2+2-C42*2))","v":0},null,"M10",{"$f":"'M10'!W$30","v":0},0,{"$f":"IF(H42=0,,IF('INFO Blatt'!B$3<6,14-H42*2,'INFO Blatt'!B$3*2+2-H42*2))","v":0},null,"M10",{"$f":"'M10'!AA$30","v":0},0,{"$f":"IF(M42=0,,IF('INFO Blatt'!B$3<6,14-M42*2,'INFO Blatt'!B$3*2+2-M42*2))","v":0}]

{"sheet":"Hehlen","index":4,"n_rows":30,"n_cols":33,"rows_kept":30,"cut":false,"hidden":false,"merged":[[6,19,6,22],[6,23,6,26],[0,12,0,13],[2,0,2,1],[2,5,2,7],[2,12,2,13],[8,0,9,0],[8,1,9,1],[8,2,9,2],[8,3,9,3],[8,4,9,4],[6,3,6,6],[6,7,6,10],[6,11,6,14],[6,15,6,18],[8,6,9,6],[8,7,9,7],[8,8,9,8],[8,10,9,10],[8,11,9,11],[8,12,9,12],[4,14,4,16],[2,14,2,16],[0,14,0,16],[10,23,11,23],[10,24,11,24],[10,26,11,26],[8,22,9,22],[8,23,9,23],[8,24,9,24],[8,26,9,26],[8,27,9,27],[8,14,9,14],[8,15,9,15],[8,16,9,16],[8,18,9,18],[8,19,9,19],[8,20,9,20],[10,27,11,27],[10,22,11,22],[10,15,11,15],[12,0,13,0],[12,1,13,1],[12,2,13,2],[12,3,13,3],[10,14,11,14],[10,16,11,16],[10,18,11,18],[10,19,11,19],[10,20,11,20],[10,6,11,6],[10,7,11,7],[10,8,11,8],[10,10,11,10],[10,11,11,11],[10,12,11,12],[10,0,11,0],[10,1,11,1],[10,2,11,2],[10,3,11,3],[10,4,11,4],[12,20,13,20],[12,4,13,4],[12,6,13,6],[12,7,13,7],[12,22,13,22],[12,23,13,23],[12,24,13,24],[12,26,13,26],[14,26,15,26],[12,27,13,27],[12,12,13,12],[12,14,13,14],[12,15,13,15],[12,16,13,16],[12,18,13,18],[12,19,13,19],[14,27,15,27],[14,22,15,22],[14,23,15,23],[14,24,15,24],[16,0,17,0],[16,1,17,1],[16,2,17,2],[16,3,17,3],[16,4,17,4],[16,6,17,6],[14,18,15,18],[14,19,15,19],[14,20,15,20],[14,10,15,10],[14,11,15,11],[14,12,15,12],[14,14,15,14],[14,15,15,15],[14,16,15,16],[14,0,15,0],[14,1,15,1],[14,2,15,2],[14,3,15,3],[14,4,15,4],[14,6,15,6],[14,7,15,7],[14,8,15,8],[16,23,17,23],[16,24,17,24],[16,26,17,26],[16,27,17,27],[18,0,19,0],[18,1,19,1],[18,2,19,2],[18,3,19,3],[16,15,17,15],[16,16,17,16],[16,18,17,18],[16,19,17,19],[16,20,17,20],[16,22,17,22],[16,7,17,7],[16,8,17,8],[16,10,17,10],[16,11,17,11],[16,12,17,12],[16,14,17,14],[18,27,19,27],[18,12,19,12],[18,14,19,14],[18,15,19,15],[18,20,19,20],[18,22,19,22],[18,23,19,23],[18,24,19,24],[18,16,19,16],[18,18,19,18],[18,19,19,19],[18,4,19,4],[18,6,19,6],[18,7,19,7],[18,8,19,8],[18,10,19,10],[18,11,19,11],[18,26,19,26],[20,26,21,26],[20,27,21,27],[22,0,23,0],[22,1,23,1],[22,2,23,2],[22,3,23,3],[22,4,23,4],[22,6,23,6],[20,18,21,18],[20,19,21,19],[20,20,21,20],[20,22,21,22],[20,23,21,23],[20,24,21,24],[20,10,21,10],[20,11,21,11],[20,12,21,12],[20,14,21,14],[20,15,21,15],[22,23,23,23],[22,24,23,24],[22,26,23,26],[22,27,23,27],[22,22,23,22],[22,7,23,7],[22,8,23,8],[22,10,23,10],[22,11,23,11],[22,12,23,12],[22,14,23,14],[24,22,25,22],[24,23,25,23],[24,7,25,7],[24,8,25,8],[24,10,25,10],[24,11,25,11],[22,15,23,15],[22,16,23,16],[22,18,23,18],[22,19,23,19],[22,20,23,20],[24,24,25,24],[24,26,25,26],[26,26,27,26],[24,27,25,27],[24,12,25,12],[24,14,25,14],[24,15,25,15],[24,16,25,16],[24,18,25,18],[24,19,25,19],[26,27,27,27],[26,22,27,22],[26,23,27,23],[26,24,27,24],[24,20,25,20],[26,18,27,18],[26,19,27,19],[26,20,27,20],[26,0,27,0],[26,1,27,1],[26,2,27,2],[26,3,27,3],[26,4,27,4],[26,6,27,6],[26,7,27,7],[26,8,27,8],[20,0,21,0],[20,1,21,1],[20,2,21,2],[20,3,21,3],[24,0,25,0],[24,1,25,1],[24,2,25,2],[24,3,25,3],[24,4,25,4],[24,6,25,6],[20,4,21,4],[20,6,21,6],[20,7,21,7],[20,8,21,8],[12,8,13,8],[12,10,13,10],[12,11,13,11],[26,10,27,10],[26,11,27,11],[26,12,27,12],[26,14,27,14],[26,15,27,15],[26,16,27,16],[20,16,21,16]]}
["Wettkampfbogen",null,null,null,null,null,null,null,null,null,null,null,"Datum:",null,{"$f":"'INFO Blatt'!B13","v":"2018-03-03"}]
[]
[null,null,null,null,null,null,null,null,null,null,null,null,"Ort:",null,{"$f":"'INFO Blatt'!B11","v":"Hehlen"}]
[]
[null,null,null,null,null,null,null,null,null,null,null,null,null,"Liga:",{"$f":"'INFO Blatt'!B7","v":"Schülerliga Süd"}]
[]
["Name","Verein","Jg","Boden",null,null,null,"Pferd",null,null,null,"Ringe",null,null,null,"Sprung",null,null,null,"Barren",null,null,null,"Reck",null,null,null,"Ges."]
[null,null,null,"D-Note","Abzug OK","E- Abzug","Note","D-Note","Abzug OK","E- Abzug","Note","D-Note","Abzug OK","E-Abzug","Note","D-Note","Abzug OK","E-Abzug","Note","D-Note","Abzug OK","E-Abzug","Note","D-Note","Abzug OK","E-Abzug","Note"]
["Paul Bähr",{"$f":"Formeln!A6","v":"TC Jahn Hehlen"},{"$f":"IF(A9<>\"\",VLOOKUP(A9,'Wertungszettel M2'!A$7:B$36,2,0),\"\")","v":"05"},null,null,null,{"$f":"IF(AND(F9>0,F10>0),IF(OR(F9>10,F9<0,F10>10,F10<0),\"Fehler\",IF(ABS(D9)-ABS(E9)-(F9+F10)/2+10>0,IF(D9<0,-(ABS(D9)-ABS(E9)-(F9+F10)/2+10),D9-ABS(E9)-(F9+F10)/2+10),0)),0)","v":0},null,null,null,{"$f":"IF(AND(J9>0,J10>0),IF(OR(J9>10,J9<0,J10>10,J10<0),\"Fehler\",IF(ABS(H9)-ABS(I9)-(J9+J10)/2+10>0,IF(H9<0,-(ABS(H9)-ABS(I9)-(J9+J10)/2+10),H9-ABS(I9)-(J9+J10)/2+10),0)),0)","v":0},null,null,null,{"$f":"IF(AND(N9>0,N10>0),IF(OR(N9>10,N9<0,N10>10,N10<0),\"Fehler\",IF(ABS(L9)-ABS(M9)-(N9+N10)/2+10>0,IF(L9<0,-(ABS(L9)-ABS(M9)-(N9+N10)/2+10),L9-ABS(M9)-(N9+N10)/2+10),0)),0)","v":0},null,null,null,{"$f":"IF(AND(R9>0,R10>0),IF(OR(R9>10,R9<0,R10>10,R10<0),\"Fehler\",IF(ABS(P9)-ABS(Q9)-(R9+R10)/2+10>0,IF(P9<0,-(ABS(P9)-ABS(Q9)-(R9+R10)/2+10),P9-ABS(Q9)-(R9+R10)/2+10),0)),0)","v":0},null,null,null,{"$f":"IF(AND(V9>0,V10>0),IF(OR(V9>10,V9<0,V10>10,V10<0),\"Fehler\",IF(ABS(T9)-ABS(U9)-(V9+V10)/2+10>0,IF(T9<0,-(ABS(T9)-ABS(U9)-(V9+V10)/2+10),T9-ABS(U9)-(V9+V10)/2+10),0)),0)","v":0},null,null,null,{"$f":"IF(AND(Z9>0,Z10>0),IF(OR(Z9>10,Z9<0,Z10>10,Z10<0),\"Fehler\",IF(ABS(X9)-ABS(Y9)-(Z9+Z10)/2+10>0,IF(X9<0,-(ABS(X9)-ABS(Y9)-(Z9+Z10)/2+10),X9-ABS(Y9)-(Z9+Z10)/2+10),0)),0)","v":0},{"$f":"ABS(G9)+ABS(K9)+ABS(O9)+ABS(S9)+ABS(W9)+ABS(AA9)","v":0}]
[]
["Benjamin Berg",{"$f":"IF(A11>0,B9,\"\")","v":"TC Jahn Hehlen"},{"$f":"IF(A11<>\"\",VLOOKUP(A11,'Wertungszettel M2'!A$7:B$36,2,0),\"\")","v":"07"},5,null,1.2,{"$f":"IF(AND(F11>0,F12>0),IF(OR(F11>10,F11<0,F12>10,F12<0),\"Fehler\",IF(ABS(D11)-ABS(E11)-(F11+F12)/2+10>0,IF(D11<0,-(ABS(D11)-ABS(E11)-(F11+F12)/2+10),D11-ABS(E11)-(F11+F12)/2+10),0)),0)","v":13.8},5,null,2.5,{"$f":"IF(AND(J11>0,J12>0),IF(OR(J11>10,J11<0,J12>10,J12<0),\"Fehler\",IF(ABS(H11)-ABS(I11)-(J11+J12)/2+10>0,IF(H11<0,-(ABS(H11)-ABS(I11)-(J11+J12)/2+10),H11-ABS(I11)-(J11+J12)/2+10),0)),0)","v":12.5},6,null,2.6,{"$f":"IF(AND(N11>0,N12>0),IF(OR(N11>10,N11<0,N12>10,N12<0),\"Fehler\",IF(ABS(L11)-ABS(M11)-(N11+N12)/2+10>0,IF(L11<0,-(ABS(L11)-ABS(M11)-(N11+N12)/2+10),L11-ABS(M11)-(N11+N12)/2+10),0)),0)","v":13.5},7,null,2.2000000000000002,{"$f":"IF(AND(R11>0,R12>0),IF(OR(R11>10,R11<0,R12>10,R12<0),\"Fehler\",IF(ABS(P11)-ABS(Q11)-(R11+R12)/2+10>0,IF(P11<0,-(ABS(P11)-ABS(Q11)-(R11+R12)/2+10),P11-ABS(Q11)-(R11+R12)/2+10),0)),0)","v":14.6},5,null,2.1,{"$f":"IF(AND(V11>0,V12>0),IF(OR(V11>10,V11<0,V12>10,V12<0),\"Fehler\",IF(ABS(T11)-ABS(U11)-(V11+V12)/2+10>0,IF(T11<0,-(ABS(T11)-ABS(U11)-(V11+V12)/2+10),T11-ABS(U11)-(V11+V12)/2+10),0)),0)","v":12.8},5,null,1.6,{"$f":"IF(AND(Z11>0,Z12>0),IF(OR(Z11>10,Z11<0,Z12>10,Z12<0),\"Fehler\",IF(ABS(X11)-ABS(Y11)-(Z11+Z12)/2+10>0,IF(X11<0,-(ABS(X11)-ABS(Y11)-(Z11+Z12)/2+10),X11-ABS(Y11)-(Z11+Z12)/2+10),0)),0)","v":13.25},{"$f":"ABS(G11)+ABS(K11)+ABS(O11)+ABS(S11)+ABS(W11)+ABS(AA11)","v":80.45},null,null,null,"Boden",{"$f":"IF(G30>1,1,0)","v":1}]
[null,null,null,null,null,1.2,null,null,null,2.5,null,null,null,2.4,null,null,null,2.6,null,null,null,2.2999999999999998,null,null,null,1.9,null,null,null,null,null,"pauschenpferd",{"$f":"IF(K30>1,1,0)","v":1}]
["Niklas Bohlender",{"$f":"IF(A13>0,B11,\"\")","v":"TC Jahn Hehlen"},{"$f":"IF(A13<>\"\",VLOOKUP(A13,'Wertungszettel M2'!A$7:B$36,2,0),\"\")","v":"04"},null,null,null,{"$f":"IF(AND(F13>0,F14>0),IF(OR(F13>10,F13<0,F14>10,F14<0),\"Fehler\",IF(ABS(D13)-ABS(E13)-(F13+F14)/2+10>0,IF(D13<0,-(ABS(D13)-ABS(E13)-(F13+F14)/2+10),D13-ABS(E13)-(F13+F14)/2+10),0)),0)","v":0},null,null,null,{"$f":"IF(AND(J13>0,J14>0),IF(OR(J13>10,J13<0,J14>10,J14<0),\"Fehler\",IF(ABS(H13)-ABS(I13)-(J13+J14)/2+10>0,IF(H13<0,-(ABS(H13)-ABS(I13)-(J13+J14)/2+10),H13-ABS(I13)-(J13+J14)/2+10),0)),0)","v":0},8,null,3,{"$f":"IF(AND(N13>0,N14>0),IF(OR(N13>10,N13<0,N14>10,N14<0),\"Fehler\",IF(ABS(L13)-ABS(M13)-(N13+N14)/2+10>0,IF(L13<0,-(ABS(L13)-ABS(M13)-(N13+N14)/2+10),L13-ABS(M13)-(N13+N14)/2+10),0)),0)","v":15},null,null,null,{"$f":"IF(AND(R13>0,R14>0),IF(OR(R13>10,R13<0,R14>10,R14<0),\"Fehler\",IF(ABS(P13)-ABS(Q13)-(R13+R14)/2+10>0,IF(P13<0,-(ABS(P13)-ABS(Q13)-(R13+R14)/2+10),P13-ABS(Q13)-(R13+R14)/2+10),0)),0)","v":0},6,null,2.9,{"$f":"IF(AND(V13>0,V14>0),IF(OR(V13>10,V13<0,V14>10,V14<0),\"Fehler\",IF(ABS(T13)-ABS(U13)-(V13+V14)/2+10>0,IF(T13<0,-(ABS(T13)-ABS(U13)-(V13+V14)/2+10),T13-ABS(U13)-(V13+V14)/2+10),0)),0)","v":13.05},6,null,2.5,{"$f":"IF(AND(Z13>0,Z14>0),IF(OR(Z13>10,Z13<0,Z14>10,Z14<0),\"Fehler\",IF(ABS(X13)-ABS(Y13)-(Z13+Z14)/2+10>0,IF(X13<0,-(ABS(X13)-ABS(Y13)-(Z13+Z14)/2+10),X13-ABS(Y13)-(Z13+Z14)/2+10),0)),0)","v":13.4},{"$f":"ABS(G13)+ABS(K13)+ABS(O13)+ABS(S13)+ABS(W13)+ABS(AA13)","v":41.45},null,null,null,"ringe",{"$f":"IF(O30>1,1,0)","v":1}]
[null,null,null,null,null,null,null,null,null,null,null,null,null,3,null,null,null,null,null,null,null,3,null,null,null,2.7,null,null,null,null,null,"sprung",{"$f":"IF(S30>1,1,0)","v":1}]
["Niclas Brinkmann",{"$f":"IF(A15>0,B13,\"\")","v":"TC Jahn Hehlen"},{"$f":"IF(A15<>\"\",VLOOKUP(A15,'Wertungszettel M2'!A$7:B$36,2,0),\"\")","v":"05"},9,null,2.5,{"$f":"IF(AND(F15>0,F16>0),IF(OR(F15>10,F15<0,F16>10,F16<0),\"Fehler\",IF(ABS(D15)-ABS(E15)-(F15+F16)/2+10>0,IF(D15<0,-(ABS(D15)-ABS(E15)-(F15+F16)/2+10),D15-ABS(E15)-(F15+F16)/2+10),0)),0)","v":16.399999999999999},7,null,0.8,{"$f":"IF(AND(J15>0,J16>0),IF(OR(J15>10,J15<0,J16>10,J16<0),\"Fehler\",IF(ABS(H15)-ABS(I15)-(J15+J16)/2+10>0,IF(H15<0,-(ABS(H15)-ABS(I15)-(J15+J16)/2+10),H15-ABS(I15)-(J15+J16)/2+10),0)),0)","v":16.149999999999999},8,null,1.1000000000000001,{"$f":"IF(AND(N15>0,N16>0),IF(OR(N15>10,N15<0,N16>10,N16<0),\"Fehler\",IF(ABS(L15)-ABS(M15)-(N15+N16)/2+10>0,IF(L15<0,-(ABS(L15)-ABS(M15)-(N15+N16)/2+10),L15-ABS(M15)-(N15+N16)/2+10),0)),0)","v":17},7,null,1.1000000000000001,{"$f":"IF(AND(R15>0,R16>0),IF(OR(R15>10,R15<0,R16>10,R16<0),\"Fehler\",IF(ABS(P15)-ABS(Q15)-(R15+R16)/2+10>0,IF(P15<0,-(ABS(P15)-ABS(Q15)-(R15+R16)/2+10),P15-ABS(Q15)-(R15+R16)/2+10),0)),0)","v":15.9},7,null,1,{"$f":"IF(AND(V15>0,V16>0),IF(OR(V15>10,V15<0,V16>10,V16<0),\"Fehler\",IF(ABS(T15)-ABS(U15)-(V15+V16)/2+10>0,IF(T15<0,-(ABS(T15)-ABS(U15)-(V15+V16)/2+10),T15-ABS(U15)-(V15+V16)/2+10),0)),0)","v":16},8,null,2.2000000000000002,{"$f":"IF(AND(Z15>0,Z16>0),IF(OR(Z15>10,Z15<0,Z16>10,Z16<0),\"Fehler\",IF(ABS(X15)-ABS(Y15)-(Z15+Z16)/2+10>0,IF(X15<0,-(ABS(X15)-ABS(Y15)-(Z15+Z16)/2+10),X15-ABS(Y15)-(Z15+Z16)/2+10),0)),0)","v":15.8},{"$f":"ABS(G15)+ABS(K15)+ABS(O15)+ABS(S15)+ABS(W15)+ABS(AA15)","v":97.25},null,null,null,"Barren",{"$f":"IF(W30>1,1,0)","v":1}]
[null,null,null,null,null,2.7,null,null,null,0.9,null,null,null,0.9,null,null,null,1.1000000000000001,null,null,null,1,null,null,null,2.2000000000000002,null,null,null,null,null,"Reck",{"$f":"IF(AA30>1,1,0)","v":1}]
["Jonas Firedrich",{"$f":"IF(A17>0,B15,\"\")","v":"TC Jahn Hehlen"},{"$f":"IF(A17<>\"\",VLOOKUP(A17,'Wertungszettel M2'!A$7:B$36,2,0),\"\")","v":"07"},5,null,1.3,{"$f":"IF(AND(F17>0,F18>0),IF(OR(F17>10,F17<0,F18>10,F18<0),\"Fehler\",IF(ABS(D17)-ABS(E17)-(F17+F18)/2+10>0,IF(D17<0,-(ABS(D17)-ABS(E17)-(F17+F18)/2+10),D17-ABS(E17)-(F17+F18)/2+10),0)),0)","v":13.85},5,null,3,{"$f":"IF(AND(J17>0,J18>0),IF(OR(J17>10,J17<0,J18>10,J18<0),\"Fehler\",IF(ABS(H17)-ABS(I17)-(J17+J18)/2+10>0,IF(H17<0,-(ABS(H17)-ABS(I17)-(J17+J18)/2+10),H17-ABS(I17)-(J17+J18)/2+10),0)),0)","v":12},6,1.5,2.8,{"$f":"IF(AND(N17>0,N18>0),IF(OR(N17>10,N17<0,N18>10,N18<0),\"Fehler\",IF(ABS(L17)-ABS(M17)-(N17+N18)/2+10>0,IF(L17<0,-(ABS(L17)-ABS(M17)-(N17+N18)/2+10),L17-ABS(M17)-(N17+N18)/2+10),0)),0)","v":11.8},5,null,1.4,{"$f":"IF(AND(R17>0,R18>0),IF(OR(R17>10,R17<0,R18>10,R18<0),\"Fehler\",IF(ABS(P17)-ABS(Q17)-(R17+R18)/2+10>0,IF(P17<0,-(ABS(P17)-ABS(Q17)-(R17+R18)/2+10),P17-ABS(Q17)-(R17+R18)/2+10),0)),0)","v":13.6},5,null,2.2999999999999998,{"$f":"IF(AND(V17>0,V18>0),IF(OR(V17>10,V17<0,V18>10,V18<0),\"Fehler\",IF(ABS(T17)-ABS(U17)-(V17+V18)/2+10>0,IF(T17<0,-(ABS(T17)-ABS(U17)-(V17+V18)/2+10),T17-ABS(U17)-(V17+V18)/2+10),0)),0)","v":12.6},5,null,2.1,{"$f":"IF(AND(Z17>0,Z18>0),IF(OR(Z17>10,Z17<0,Z18>10,Z18<0),\"Fehler\",IF(ABS(X17)-ABS(Y17)-(Z17+Z18)/2+10>0,IF(X17<0,-(ABS(X17)-ABS(Y17)-(Z17+Z18)/2+10),X17-ABS(Y17)-(Z17+Z18)/2+10),0)),0)","v":13},{"$f":"ABS(G17)+ABS(K17)+ABS(O17)+ABS(S17)+ABS(W17)+ABS(AA17)","v":76.850000000000009}]
[null,null,null,null,null,1,null,null,null,3,null,null,null,2.6,null,null,null,1.4,null,null,null,2.5,null,null,null,1.9,null,null,null,null,null,"Gesamt",{"$f":"SUM(AG11:AG17)","v":6}]
["Ilja Kant",{"$f":"IF(A19>0,B17,\"\")","v":"TC Jahn Hehlen"},{"$f":"IF(A19<>\"\",VLOOKUP(A19,'Wertungszettel M2'!A$7:B$36,2,0),\"\")","v":"06"},5,null,2.1,{"$f":"IF(AND(F19>0,F20>0),IF(OR(F19>10,F19<0,F20>10,F20<0),\"Fehler\",IF(ABS(D19)-ABS(E19)-(F19+F20)/2+10>0,IF(D19<0,-(ABS(D19)-ABS(E19)-(F19+F20)/2+10),D19-ABS(E19)-(F19+F20)/2+10),0)),0)","v":12.9},5,null,2.8,{"$f":"IF(AND(J19>0,J20>0),IF(OR(J19>10,J19<0,J20>10,J20<0),\"Fehler\",IF(ABS(H19)-ABS(I19)-(J19+J20)/2+10>0,IF(H19<0,-(ABS(H19)-ABS(I19)-(J19+J20)/2+10),H19-ABS(I19)-(J19+J20)/2+10),0)),0)","v":12.15},6,1,2.6,{"$f":"IF(AND(N19>0,N20>0),IF(OR(N19>10,N19<0,N20>10,N20<0),\"Fehler\",IF(ABS(L19)-ABS(M19)-(N19+N20)/2+10>0,IF(L19<0,-(ABS(L19)-ABS(M19)-(N19+N20)/2+10),L19-ABS(M19)-(N19+N20)/2+10),0)),0)","v":12.5},7,null,2.2999999999999998,{"$f":"IF(AND(R19>0,R20>0),IF(OR(R19>10,R19<0,R20>10,R20<0),\"Fehler\",IF(ABS(P19)-ABS(Q19)-(R19+R20)/2+10>0,IF(P19<0,-(ABS(P19)-ABS(Q19)-(R19+R20)/2+10),P19-ABS(Q19)-(R19+R20)/2+10),0)),0)","v":14.7},5,1.5,2.5,{"$f":"IF(AND(V19>0,V20>0),IF(OR(V19>10,V19<0,V20>10,V20<0),\"Fehler\",IF(ABS(T19)-ABS(U19)-(V19+V20)/2+10>0,IF(T19<0,-(ABS(T19)-ABS(U19)-(V19+V20)/2+10),T19-ABS(U19)-(V19+V20)/2+10),0)),0)","v":10.9},5,null,2.8,{"$f":"IF(AND(Z19>0,Z20>0),IF(OR(Z19>10,Z19<0,Z20>10,Z20<0),\"Fehler\",IF(ABS(X19)-ABS(Y19)-(Z19+Z20)/2+10>0,IF(X19<0,-(ABS(X19)-ABS(Y19)-(Z19+Z20)/2+10),X19-ABS(Y19)-(Z19+Z20)/2+10),0)),0)","v":12.4},{"$f":"ABS(G19)+ABS(K19)+ABS(O19)+ABS(S19)+ABS(W19)+ABS(AA19)","v":75.55}]
[null,null,null,null,null,2.1,null,null,null,2.9,null,null,null,2.4,null,null,null,2.2999999999999998,null,null,null,2.7,null,null,null,2.4]
["Tom Weper",{"$f":"IF(A21>0,B19,\"\")","v":"TC Jahn Hehlen"},{"$f":"IF(A21<>\"\",VLOOKUP(A21,'Wertungszettel M2'!A$7:B$36,2,0),\"\")","v":"06"},null,null,null,{"$f":"IF(AND(F21>0,F22>0),IF(OR(F21>10,F21<0,F22>10,F22<0),\"Fehler\",IF(ABS(D21)-ABS(E21)-(F21+F22)/2+10>0,IF(D21<0,-(ABS(D21)-ABS(E21)-(F21+F22)/2+10),D21-ABS(E21)-(F21+F22)/2+10),0)),0)","v":0},null,null,null,{"$f":"IF(AND(J21>0,J22>0),IF(OR(J21>10,J21<0,J22>10,J22<0),\"Fehler\",IF(ABS(H21)-ABS(I21)-(J21+J22)/2+10>0,IF(H21<0,-(ABS(H21)-ABS(I21)-(J21+J22)/2+10),H21-ABS(I21)-(J21+J22)/2+10),0)),0)","v":0},null,null,null,{"$f":"IF(AND(N21>0,N22>0),IF(OR(N21>10,N21<0,N22>10,N22<0),\"Fehler\",IF(ABS(L21)-ABS(M21)-(N21+N22)/2+10>0,IF(L21<0,-(ABS(L21)-ABS(M21)-(N21+N22)/2+10),L21-ABS(M21)-(N21+N22)/2+10),0)),0)","v":0},null,null,null,{"$f":"IF(AND(R21>0,R22>0),IF(OR(R21>10,R21<0,R22>10,R22<0),\"Fehler\",IF(ABS(P21)-ABS(Q21)-(R21+R22)/2+10>0,IF(P21<0,-(ABS(P21)-ABS(Q21)-(R21+R22)/2+10),P21-ABS(Q21)-(R21+R22)/2+10),0)),0)","v":0},null,null,null,{"$f":"IF(AND(V21>0,V22>0),IF(OR(V21>10,V21<0,V22>10,V22<0),\"Fehler\",IF(ABS(T21)-ABS(U21)-(V21+V22)/2+10>0,IF(T21<0,-(ABS(T21)-ABS(U21)-(V21+V22)/2+10),T21-ABS(U21)-(V21+V22)/2+10),0)),0)","v":0},null,null,null,{"$f":"IF(AND(Z21>0,Z22>0),IF(OR(Z21>10,Z21<0,Z22>10,Z22<0),\"Fehler\",IF(ABS(X21)-ABS(Y21)-(Z21+Z22)/2+10>0,IF(X21<0,-(ABS(X21)-ABS(Y21)-(Z21+Z22)/2+10),X21-ABS(Y21)-(Z21+Z22)/2+10),0)),0)","v":0},{"$f":"ABS(G21)+ABS(K21)+ABS(O21)+ABS(S21)+ABS(W21)+ABS(AA21)","v":0}]
[]
["Frederik Zwickert",{"$f":"IF(A23>0,B21,\"\")","v":"TC Jahn Hehlen"},{"$f":"IF(A23<>\"\",VLOOKUP(A23,'Wertungszettel M2'!A$7:B$36,2,0),\"\")","v":"07"},5,null,1.5,{"$f":"IF(AND(F23>0,F24>0),IF(OR(F23>10,F23<0,F24>10,F24<0),\"Fehler\",IF(ABS(D23)-ABS(E23)-(F23+F24)/2+10>0,IF(D23<0,-(ABS(D23)-ABS(E23)-(F23+F24)/2+10),D23-ABS(E23)-(F23+F24)/2+10),0)),0)","v":13.5},5,null,2.8,{"$f":"IF(AND(J23>0,J24>0),IF(OR(J23>10,J23<0,J24>10,J24<0),\"Fehler\",IF(ABS(H23)-ABS(I23)-(J23+J24)/2+10>0,IF(H23<0,-(ABS(H23)-ABS(I23)-(J23+J24)/2+10),H23-ABS(I23)-(J23+J24)/2+10),0)),0)","v":12.2},7,null,2.1,{"$f":"IF(AND(N23>0,N24>0),IF(OR(N23>10,N23<0,N24>10,N24<0),\"Fehler\",IF(ABS(L23)-ABS(M23)-(N23+N24)/2+10>0,IF(L23<0,-(ABS(L23)-ABS(M23)-(N23+N24)/2+10),L23-ABS(M23)-(N23+N24)/2+10),0)),0)","v":14.9},5,null,1.1000000000000001,{"$f":"IF(AND(R23>0,R24>0),IF(OR(R23>10,R23<0,R24>10,R24<0),\"Fehler\",IF(ABS(P23)-ABS(Q23)-(R23+R24)/2+10>0,IF(P23<0,-(ABS(P23)-ABS(Q23)-(R23+R24)/2+10),P23-ABS(Q23)-(R23+R24)/2+10),0)),0)","v":13.9},5,null,1.6,{"$f":"IF(AND(V23>0,V24>0),IF(OR(V23>10,V23<0,V24>10,V24<0),\"Fehler\",IF(ABS(T23)-ABS(U23)-(V23+V24)/2+10>0,IF(T23<0,-(ABS(T23)-ABS(U23)-(V23+V24)/2+10),T23-ABS(U23)-(V23+V24)/2+10),0)),0)","v":13.3},5,null,1.8,{"$f":"IF(AND(Z23>0,Z24>0),IF(OR(Z23>10,Z23<0,Z24>10,Z24<0),\"Fehler\",IF(ABS(X23)-ABS(Y23)-(Z23+Z24)/2+10>0,IF(X23<0,-(ABS(X23)-ABS(Y23)-(Z23+Z24)/2+10),X23-ABS(Y23)-(Z23+Z24)/2+10),0)),0)","v":13.25},{"$f":"ABS(G23)+ABS(K23)+ABS(O23)+ABS(S23)+ABS(W23)+ABS(AA23)","v":81.05}]
[null,null,null,null,null,1.5,null,null,null,2.8,null,null,null,2.1,null,null,null,1.1000000000000001,null,null,null,1.8,null,null,null,1.7]
[null,{"$f":"IF(A25>0,B23,\"\")","v":""},{"$f":"IF(A25<>\"\",VLOOKUP(A25,'Wertungszettel M2'!A$7:B$36,2,0),\"\")","v":""},null,null,null,{"$f":"IF(AND(F25>0,F26>0),IF(OR(F25>10,F25<0,F26>10,F26<0),\"Fehler\",IF(ABS(D25)-ABS(E25)-(F25+F26)/2+10>0,IF(D25<0,-(ABS(D25)-ABS(E25)-(F25+F26)/2+10),D25-ABS(E25)-(F25+F26)/2+10),0)),0)","v":0},null,null,null,{"$f":"IF(AND(J25>0,J26>0),IF(OR(J25>10,J25<0,J26>10,J26<0),\"Fehler\",IF(ABS(H25)-ABS(I25)-(J25+J26)/2+10>0,IF(H25<0,-(ABS(H25)-ABS(I25)-(J25+J26)/2+10),H25-ABS(I25)-(J25+J26)/2+10),0)),0)","v":0},null,null,null,{"$f":"IF(AND(N25>0,N26>0),IF(OR(N25>10,N25<0,N26>10,N26<0),\"Fehler\",IF(ABS(L25)-ABS(M25)-(N25+N26)/2+10>0,IF(L25<0,-(ABS(L25)-ABS(M25)-(N25+N26)/2+10),L25-ABS(M25)-(N25+N26)/2+10),0)),0)","v":0},null,null,null,{"$f":"IF(AND(R25>0,R26>0),IF(OR(R25>10,R25<0,R26>10,R26<0),\"Fehler\",IF(ABS(P25)-ABS(Q25)-(R25+R26)/2+10>0,IF(P25<0,-(ABS(P25)-ABS(Q25)-(R25+R26)/2+10),P25-ABS(Q25)-(R25+R26)/2+10),0)),0)","v":0},null,null,null,{"$f":"IF(AND(V25>0,V26>0),IF(OR(V25>10,V25<0,V26>10,V26<0),\"Fehler\",IF(ABS(T25)-ABS(U25)-(V25+V26)/2+10>0,IF(T25<0,-(ABS(T25)-ABS(U25)-(V25+V26)/2+10),T25-ABS(U25)-(V25+V26)/2+10),0)),0)","v":0},null,null,null,{"$f":"IF(AND(Z25>0,Z26>0),IF(OR(Z25>10,Z25<0,Z26>10,Z26<0),\"Fehler\",IF(ABS(X25)-ABS(Y25)-(Z25+Z26)/2+10>0,IF(X25<0,-(ABS(X25)-ABS(Y25)-(Z25+Z26)/2+10),X25-ABS(Y25)-(Z25+Z26)/2+10),0)),0)","v":0},{"$f":"ABS(G25)+ABS(K25)+ABS(O25)+ABS(S25)+ABS(W25)+ABS(AA25)","v":0}]
[]
[null,{"$f":"IF(A27>0,B25,\"\")","v":""},{"$f":"IF(A27<>\"\",VLOOKUP(A27,'Wertungszettel M2'!A$7:B$36,2,0),\"\")","v":""},null,null,null,{"$f":"IF(AND(F27>0,F28>0),IF(OR(F27>10,F27<0,F28>10,F28<0),\"Fehler\",IF(ABS(D27)-ABS(E27)-(F27+F28)/2+10>0,IF(D27<0,-(ABS(D27)-ABS(E27)-(F27+F28)/2+10),D27-ABS(E27)-(F27+F28)/2+10),0)),0)","v":0},null,null,null,{"$f":"IF(AND(J27>0,J28>0),IF(OR(J27>10,J27<0,J28>10,J28<0),\"Fehler\",IF(ABS(H27)-ABS(I27)-(J27+J28)/2+10>0,IF(H27<0,-(ABS(H27)-ABS(I27)-(J27+J28)/2+10),H27-ABS(I27)-(J27+J28)/2+10),0)),0)","v":0},null,null,null,{"$f":"IF(AND(N27>0,N28>0),IF(OR(N27>10,N27<0,N28>10,N28<0),\"Fehler\",IF(ABS(L27)-ABS(M27)-(N27+N28)/2+10>0,IF(L27<0,-(ABS(L27)-ABS(M27)-(N27+N28)/2+10),L27-ABS(M27)-(N27+N28)/2+10),0)),0)","v":0},null,null,null,{"$f":"IF(AND(R27>0,R28>0),IF(OR(R27>10,R27<0,R28>10,R28<0),\"Fehler\",IF(ABS(P27)-ABS(Q27)-(R27+R28)/2+10>0,IF(P27<0,-(ABS(P27)-ABS(Q27)-(R27+R28)/2+10),P27-ABS(Q27)-(R27+R28)/2+10),0)),0)","v":0},null,null,null,{"$f":"IF(AND(V27>0,V28>0),IF(OR(V27>10,V27<0,V28>10,V28<0),\"Fehler\",IF(ABS(T27)-ABS(U27)-(V27+V28)/2+10>0,IF(T27<0,-(ABS(T27)-ABS(U27)-(V27+V28)/2+10),T27-ABS(U27)-(V27+V28)/2+10),0)),0)","v":0},null,null,null,{"$f":"IF(AND(Z27>0,Z28>0),IF(OR(Z27>10,Z27<0,Z28>10,Z28<0),\"Fehler\",IF(ABS(X27)-ABS(Y27)-(Z27+Z28)/2+10>0,IF(X27<0,-(ABS(X27)-ABS(Y27)-(Z27+Z28)/2+10),X27-ABS(Y27)-(Z27+Z28)/2+10),0)),0)","v":0},{"$f":"ABS(G27)+ABS(K27)+ABS(O27)+ABS(S27)+ABS(W27)+ABS(AA27)","v":0}]
[]
[]
[null,null,null,null,null,null,{"$f":"SUM(LARGE(G9:G28,1),LARGE(G9:G28,2),LARGE(G9:G28,3))","v":44.05},null,null,null,{"$f":"SUM(LARGE(K9:K28,1),LARGE(K9:K28,2),LARGE(K9:K28,3))","v":40.849999999999994},null,null,null,{"$f":"SUM(LARGE(O9:O28,1),LARGE(O9:O28,2),LARGE(O9:O28,3))","v":46.9},null,null,null,{"$f":"SUM(LARGE(S9:S28,1),LARGE(S9:S28,2),LARGE(S9:S28,3))","v":45.2},null,null,null,{"$f":"SUM(LARGE(W9:W28,1),LARGE(W9:W28,2),LARGE(W9:W28,3))","v":42.35},null,null,null,{"$f":"SUM(LARGE(AA9:AA28,1),LARGE(AA9:AA28,2),LARGE(AA9:AA28,3))","v":42.45},{"$f":"SUM(G30,K30,O30,S30,W30,AA30)","v":261.8}]

{"sheet":"TG Oker SZ 1","index":5,"n_rows":30,"n_cols":33,"rows_kept":30,"cut":false,"hidden":false,"merged":[[6,19,6,22],[6,23,6,26],[0,12,0,13],[2,0,2,1],[2,5,2,7],[2,12,2,13],[8,0,9,0],[8,1,9,1],[8,2,9,2],[8,3,9,3],[8,4,9,4],[6,3,6,6],[6,7,6,10],[6,11,6,14],[6,15,6,18],[8,6,9,6],[8,7,9,7],[8,8,9,8],[8,10,9,10],[8,11,9,11],[8,12,9,12],[4,14,4,16],[10,23,11,23],[10,24,11,24],[10,26,11,26],[8,22,9,22],[8,23,9,23],[8,24,9,24],[8,26,9,26],[8,27,9,27],[8,14,9,14],[8,15,9,15],[8,16,9,16],[8,18,9,18],[8,19,9,19],[8,20,9,20],[10,27,11,27],[10,22,11,22],[10,20,11,20],[12,0,13,0],[12,1,13,1],[12,2,13,2],[12,3,13,3],[10,14,11,14],[10,16,11,16],[10,18,11,18],[10,19,11,19],[12,4,13,4],[12,6,13,6],[12,7,13,7],[12,8,13,8],[10,6,11,6],[10,7,11,7],[10,8,11,8],[10,10,11,10],[10,11,11,11],[10,12,11,12],[10,0,11,0],[10,1,11,1],[10,2,11,2],[10,3,11,3],[10,4,11,4],[12,20,13,20],[12,22,13,22],[12,23,13,23],[12,24,13,24],[12,26,13,26],[14,26,15,26],[12,27,13,27],[12,12,13,12],[12,14,13,14],[12,15,13,15],[12,16,13,16],[12,18,13,18],[12,19,13,19],[14,27,15,27],[14,22,15,22],[14,23,15,23],[14,24,15,24],[16,0,17,0],[16,1,17,1],[16,2,17,2],[16,3,17,3],[16,4,17,4],[16,6,17,6],[14,18,15,18],[14,19,15,19],[14,20,15,20],[14,10,15,10],[14,11,15,11],[14,12,15,12],[14,14,15,14],[14,15,15,15],[14,16,15,16],[14,0,15,0],[14,1,15,1],[14,2,15,2],[14,3,15,3],[14,4,15,4],[14,6,15,6],[14,7,15,7],[14,8,15,8],[16,23,17,23],[16,24,17,24],[16,26,17,26],[16,27,17,27],[18,0,19,0],[18,1,19,1],[18,2,19,2],[18,3,19,3],[16,15,17,15],[16,16,17,16],[16,18,17,18],[16,19,17,19],[16,20,17,20],[16,22,17,22],[16,7,17,7],[16,8,17,8],[16,10,17,10],[16,11,17,11],[16,12,17,12],[16,14,17,14],[18,27,19,27],[18,12,19,12],[18,14,19,14],[18,15,19,15],[18,20,19,20],[18,22,19,22],[18,23,19,23],[18,24,19,24],[18,16,19,16],[18,18,19,18],[18,19,19,19],[18,4,19,4],[18,6,19,6],[18,7,19,7],[18,8,19,8],[18,10,19,10],[18,11,19,11],[18,26,19,26],[20,26,21,26],[20,27,21,27],[22,0,23,0],[22,1,23,1],[22,2,23,2],[22,3,23,3],[22,4,23,4],[22,6,23,6],[20,18,21,18],[20,19,21,19],[20,20,21,20],[20,22,21,22],[20,23,21,23],[20,24,21,24],[20,10,21,10],[20,11,21,11],[20,12,21,12],[20,14,21,14],[20,15,21,15],[22,23,23,23],[22,24,23,24],[22,26,23,26],[22,27,23,27],[22,22,23,22],[22,7,23,7],[22,8,23,8],[22,10,23,10],[22,11,23,11],[22,12,23,12],[22,14,23,14],[24,22,25,22],[24,23,25,23],[24,7,25,7],[24,8,25,8],[24,10,25,10],[24,11,25,11],[22,15,23,15],[22,16,23,16],[22,18,23,18],[22,19,23,19],[22,20,23,20],[24,24,25,24],[24,26,25,26],[26,26,27,26],[24,27,25,27],[24,12,25,12],[24,14,25,14],[24,15,25,15],[24,16,25,16],[24,18,25,18],[24,19,25,19],[26,27,27,27],[26,22,27,22],[26,23,27,23],[26,24,27,24],[24,20,25,20],[26,18,27,18],[26,19,27,19],[26,20,27,20],[26,10,27,10],[26,11,27,11],[26,12,27,12],[26,14,27,14],[26,15,27,15],[26,16,27,16],[2,14,2,16],[0,14,0,16],[10,15,11,15],[12,10,13,10],[20,16,21,16],[12,11,13,11],[26,0,27,0],[26,1,27,1],[26,2,27,2],[26,3,27,3],[26,4,27,4],[26,6,27,6],[26,7,27,7],[26,8,27,8],[20,0,21,0],[20,1,21,1],[20,2,21,2],[20,3,21,3],[24,0,25,0],[24,1,25,1],[24,2,25,2],[24,3,25,3],[24,4,25,4],[24,6,25,6],[20,4,21,4],[20,6,21,6],[20,7,21,7],[20,8,21,8]]}
["Wettkampfbogen",null,null,null,null,null,null,null,null,null,null,null,"Datum:",null,{"$f":"'INFO Blatt'!B13","v":"2018-03-03"}]
[]
[null,null,null,null,null,null,null,null,null,null,null,null,"Ort:",null,{"$f":"'INFO Blatt'!B11","v":"Hehlen"}]
[]
[null,null,null,null,null,null,null,null,null,null,null,null,null,"Liga:",{"$f":"'INFO Blatt'!B7","v":"Schülerliga Süd"}]
[]
["Name","Verein","Jg","Boden",null,null,null,"Pferd",null,null,null,"Ringe",null,null,null,"Sprung",null,null,null,"Barren",null,null,null,"Reck",null,null,null,"Ges."]
[null,null,null,"D-Note","Abzug OK","E- Abzug","Note","D-Note","Abzug OK","E- Abzug","Note","D-Note","Abzug OK","E-Abzug","Note","D-Note","Abzug OK","E-Abzug","Note","D-Note","Abzug OK","E-Abzug","Note","D-Note","Abzug OK","E-Abzug","Note"]
["Nils Honisch",{"$f":"Formeln!A7","v":"TG Oker Salzgitter 1"},{"$f":"IF(A9<>\"\", VLOOKUP(A9,'Wertungszettel M3'!A$7:B$40,2,0),\"\")","v":"04"},6,null,2,{"$f":"IF(AND(F9>0,F10>0),IF(OR(F9>10,F9<0,F10>10,F10<0),\"Fehler\",IF(ABS(D9)-ABS(E9)-(F9+F10)/2+10>0,IF(D9<0,-(ABS(D9)-ABS(E9)-(F9+F10)/2+10),D9-ABS(E9)-(F9+F10)/2+10),0)),0)","v":14.1},7,null,1.8,{"$f":"IF(AND(J9>0,J10>0),IF(OR(J9>10,J9<0,J10>10,J10<0),\"Fehler\",IF(ABS(H9)-ABS(I9)-(J9+J10)/2+10>0,IF(H9<0,-(ABS(H9)-ABS(I9)-(J9+J10)/2+10),H9-ABS(I9)-(J9+J10)/2+10),0)),0)","v":15.25},6,0.5,1.2,{"$f":"IF(AND(N9>0,N10>0),IF(OR(N9>10,N9<0,N10>10,N10<0),\"Fehler\",IF(ABS(L9)-ABS(M9)-(N9+N10)/2+10>0,IF(L9<0,-(ABS(L9)-ABS(M9)-(N9+N10)/2+10),L9-ABS(M9)-(N9+N10)/2+10),0)),0)","v":14.3},8,null,1.8,{"$f":"IF(AND(R9>0,R10>0),IF(OR(R9>10,R9<0,R10>10,R10<0),\"Fehler\",IF(ABS(P9)-ABS(Q9)-(R9+R10)/2+10>0,IF(P9<0,-(ABS(P9)-ABS(Q9)-(R9+R10)/2+10),P9-ABS(Q9)-(R9+R10)/2+10),0)),0)","v":16.100000000000001},7,null,2.2999999999999998,{"$f":"IF(AND(V9>0,V10>0),IF(OR(V9>10,V9<0,V10>10,V10<0),\"Fehler\",IF(ABS(T9)-ABS(U9)-(V9+V10)/2+10>0,IF(T9<0,-(ABS(T9)-ABS(U9)-(V9+V10)/2+10),T9-ABS(U9)-(V9+V10)/2+10),0)),0)","v":14.6},7,null,2.6,{"$f":"IF(AND(Z9>0,Z10>0),IF(OR(Z9>10,Z9<0,Z10>10,Z10<0),\"Fehler\",IF(ABS(X9)-ABS(Y9)-(Z9+Z10)/2+10>0,IF(X9<0,-(ABS(X9)-ABS(Y9)-(Z9+Z10)/2+10),X9-ABS(Y9)-(Z9+Z10)/2+10),0)),0)","v":14.4},{"$f":"ABS(G9)+ABS(K9)+ABS(O9)+ABS(S9)+ABS(W9)+ABS(AA9)","v":88.750000000000014}]
[null,null,null,null,null,1.8,null,null,null,1.7,null,null,null,1.2,null,null,null,2,null,null,null,2.5,null,null,null,2.6]
["Tim Honisch",{"$f":"IF(A11>0,B9,\"\")","v":"TG Oker Salzgitter 1"},{"$f":"IF(A11<>\"\", VLOOKUP(A11,'Wertungszettel M3'!A$7:B$40,2,0),\"\")","v":"06"},6,null,2,{"$f":"IF(AND(F11>0,F12>0),IF(OR(F11>10,F11<0,F12>10,F12<0),\"Fehler\",IF(ABS(D11)-ABS(E11)-(F11+F12)/2+10>0,IF(D11<0,-(ABS(D11)-ABS(E11)-(F11+F12)/2+10),D11-ABS(E11)-(F11+F12)/2+10),0)),0)","v":13.95},7,null,3,{"$f":"IF(AND(J11>0,J12>0),IF(OR(J11>10,J11<0,J12>10,J12<0),\"Fehler\",IF(ABS(H11)-ABS(I11)-(J11+J12)/2+10>0,IF(H11<0,-(ABS(H11)-ABS(I11)-(J11+J12)/2+10),H11-ABS(I11)-(J11+J12)/2+10),0)),0)","v":13.9},6,null,2.5,{"$f":"IF(AND(N11>0,N12>0),IF(OR(N11>10,N11<0,N12>10,N12<0),\"Fehler\",IF(ABS(L11)-ABS(M11)-(N11+N12)/2+10>0,IF(L11<0,-(ABS(L11)-ABS(M11)-(N11+N12)/2+10),L11-ABS(M11)-(N11+N12)/2+10),0)),0)","v":13.5},7,null,2.4,{"$f":"IF(AND(R11>0,R12>0),IF(OR(R11>10,R11<0,R12>10,R12<0),\"Fehler\",IF(ABS(P11)-ABS(Q11)-(R11+R12)/2+10>0,IF(P11<0,-(ABS(P11)-ABS(Q11)-(R11+R12)/2+10),P11-ABS(Q11)-(R11+R12)/2+10),0)),0)","v":14.55},6,null,2,{"$f":"IF(AND(V11>0,V12>0),IF(OR(V11>10,V11<0,V12>10,V12<0),\"Fehler\",IF(ABS(T11)-ABS(U11)-(V11+V12)/2+10>0,IF(T11<0,-(ABS(T11)-ABS(U11)-(V11+V12)/2+10),T11-ABS(U11)-(V11+V12)/2+10),0)),0)","v":14.25},6,null,4,{"$f":"IF(AND(Z11>0,Z12>0),IF(OR(Z11>10,Z11<0,Z12>10,Z12<0),\"Fehler\",IF(ABS(X11)-ABS(Y11)-(Z11+Z12)/2+10>0,IF(X11<0,-(ABS(X11)-ABS(Y11)-(Z11+Z12)/2+10),X11-ABS(Y11)-(Z11+Z12)/2+10),0)),0)","v":12.05},{"$f":"ABS(G11)+ABS(K11)+ABS(O11)+ABS(S11)+ABS(W11)+ABS(AA11)","v":82.2},null,null,null,"Boden",{"$f":"IF(G30>1,1,0)","v":1}]
[null,null,null,null,null,2.1,null,null,null,3.2,null,null,null,2.5,null,null,null,2.5,null,null,null,1.5,null,null,null,3.9,null,null,null,null,null,"pauschenpferd",{"$f":"IF(K30>1,1,0)","v":1}]
["Jarik Siebold",{"$f":"IF(A13>0,B11,\"\")","v":"TG Oker Salzgitter 1"},{"$f":"IF(A13<>\"\", VLOOKUP(A13,'Wertungszettel M3'!A$7:B$40,2,0),\"\")","v":"06"},null,null,null,{"$f":"IF(AND(F13>0,F14>0),IF(OR(F13>10,F13<0,F14>10,F14<0),\"Fehler\",IF(ABS(D13)-ABS(E13)-(F13+F14)/2+10>0,IF(D13<0,-(ABS(D13)-ABS(E13)-(F13+F14)/2+10),D13-ABS(E13)-(F13+F14)/2+10),0)),0)","v":0},5,null,2.4,{"$f":"IF(AND(J13>0,J14>0),IF(OR(J13>10,J13<0,J14>10,J14<0),\"Fehler\",IF(ABS(H13)-ABS(I13)-(J13+J14)/2+10>0,IF(H13<0,-(ABS(H13)-ABS(I13)-(J13+J14)/2+10),H13-ABS(I13)-(J13+J14)/2+10),0)),0)","v":12.45},6,null,2.2999999999999998,{"$f":"IF(AND(N13>0,N14>0),IF(OR(N13>10,N13<0,N14>10,N14<0),\"Fehler\",IF(ABS(L13)-ABS(M13)-(N13+N14)/2+10>0,IF(L13<0,-(ABS(L13)-ABS(M13)-(N13+N14)/2+10),L13-ABS(M13)-(N13+N14)/2+10),0)),0)","v":13.7},null,null,null,{"$f":"IF(AND(R13>0,R14>0),IF(OR(R13>10,R13<0,R14>10,R14<0),\"Fehler\",IF(ABS(P13)-ABS(Q13)-(R13+R14)/2+10>0,IF(P13<0,-(ABS(P13)-ABS(Q13)-(R13+R14)/2+10),P13-ABS(Q13)-(R13+R14)/2+10),0)),0)","v":0},5,null,2.9,{"$f":"IF(AND(V13>0,V14>0),IF(OR(V13>10,V13<0,V14>10,V14<0),\"Fehler\",IF(ABS(T13)-ABS(U13)-(V13+V14)/2+10>0,IF(T13<0,-(ABS(T13)-ABS(U13)-(V13+V14)/2+10),T13-ABS(U13)-(V13+V14)/2+10),0)),0)","v":11.95},5,null,2.2000000000000002,{"$f":"IF(AND(Z13>0,Z14>0),IF(OR(Z13>10,Z13<0,Z14>10,Z14<0),\"Fehler\",IF(ABS(X13)-ABS(Y13)-(Z13+Z14)/2+10>0,IF(X13<0,-(ABS(X13)-ABS(Y13)-(Z13+Z14)/2+10),X13-ABS(Y13)-(Z13+Z14)/2+10),0)),0)","v":12.9},{"$f":"ABS(G13)+ABS(K13)+ABS(O13)+ABS(S13)+ABS(W13)+ABS(AA13)","v":50.999999999999993},null,null,null,"ringe",{"$f":"IF(O30>1,1,0)","v":1}]
[null,null,null,null,null,null,null,null,null,2.7,null,null,null,2.2999999999999998,null,null,null,null,null,null,null,3.2,null,null,null,2,null,null,null,null,null,"sprung",{"$f":"IF(S30>1,1,0)","v":1}]
["Robert Knoke",{"$f":"IF(A15>0,B13,\"\")","v":"TG Oker Salzgitter 1"},{"$f":"IF(A15<>\"\", VLOOKUP(A15,'Wertungszettel M3'!A$7:B$40,2,0),\"\")","v":"05"},9,null,2.6,{"$f":"IF(AND(F15>0,F16>0),IF(OR(F15>10,F15<0,F16>10,F16<0),\"Fehler\",IF(ABS(D15)-ABS(E15)-(F15+F16)/2+10>0,IF(D15<0,-(ABS(D15)-ABS(E15)-(F15+F16)/2+10),D15-ABS(E15)-(F15+F16)/2+10),0)),0)","v":16.399999999999999},7,null,0.9,{"$f":"IF(AND(J15>0,J16>0),IF(OR(J15>10,J15<0,J16>10,J16<0),\"Fehler\",IF(ABS(H15)-ABS(I15)-(J15+J16)/2+10>0,IF(H15<0,-(ABS(H15)-ABS(I15)-(J15+J16)/2+10),H15-ABS(I15)-(J15+J16)/2+10),0)),0)","v":16.100000000000001},8,null,0.5,{"$f":"IF(AND(N15>0,N16>0),IF(OR(N15>10,N15<0,N16>10,N16<0),\"Fehler\",IF(ABS(L15)-ABS(M15)-(N15+N16)/2+10>0,IF(L15<0,-(ABS(L15)-ABS(M15)-(N15+N16)/2+10),L15-ABS(M15)-(N15+N16)/2+10),0)),0)","v":17.399999999999999},7,null,1.2,{"$f":"IF(AND(R15>0,R16>0),IF(OR(R15>10,R15<0,R16>10,R16<0),\"Fehler\",IF(ABS(P15)-ABS(Q15)-(R15+R16)/2+10>0,IF(P15<0,-(ABS(P15)-ABS(Q15)-(R15+R16)/2+10),P15-ABS(Q15)-(R15+R16)/2+10),0)),0)","v":15.8},7,null,1.4,{"$f":"IF(AND(V15>0,V16>0),IF(OR(V15>10,V15<0,V16>10,V16<0),\"Fehler\",IF(ABS(T15)-ABS(U15)-(V15+V16)/2+10>0,IF(T15<0,-(ABS(T15)-ABS(U15)-(V15+V16)/2+10),T15-ABS(U15)-(V15+V16)/2+10),0)),0)","v":15.8},7,null,1.7,{"$f":"IF(AND(Z15>0,Z16>0),IF(OR(Z15>10,Z15<0,Z16>10,Z16<0),\"Fehler\",IF(ABS(X15)-ABS(Y15)-(Z15+Z16)/2+10>0,IF(X15<0,-(ABS(X15)-ABS(Y15)-(Z15+Z16)/2+10),X15-ABS(Y15)-(Z15+Z16)/2+10),0)),0)","v":15.3},{"$f":"ABS(G15)+ABS(K15)+ABS(O15)+ABS(S15)+ABS(W15)+ABS(AA15)","v":96.8},null,null,null,"Barren",{"$f":"IF(W30>1,1,0)","v":1}]
[null,null,null,null,null,2.6,null,null,null,0.9,null,null,null,0.7,null,null,null,1.2,null,null,null,1,null,null,null,1.7,null,null,null,null,null,"Reck",{"$f":"IF(AA30>1,1,0)","v":1}]
["Leon Müller",{"$f":"IF(A17>0,B15,\"\")","v":"TG Oker Salzgitter 1"},{"$f":"IF(A17<>\"\", VLOOKUP(A17,'Wertungszettel M3'!A$7:B$40,2,0),\"\")","v":"05"},6,null,1.9,{"$f":"IF(AND(F17>0,F18>0),IF(OR(F17>10,F17<0,F18>10,F18<0),\"Fehler\",IF(ABS(D17)-ABS(E17)-(F17+F18)/2+10>0,IF(D17<0,-(ABS(D17)-ABS(E17)-(F17+F18)/2+10),D17-ABS(E17)-(F17+F18)/2+10),0)),0)","v":14},7,null,2.5,{"$f":"IF(AND(J17>0,J18>0),IF(OR(J17>10,J17<0,J18>10,J18<0),\"Fehler\",IF(ABS(H17)-ABS(I17)-(J17+J18)/2+10>0,IF(H17<0,-(ABS(H17)-ABS(I17)-(J17+J18)/2+10),H17-ABS(I17)-(J17+J18)/2+10),0)),0)","v":14.45},null,null,null,{"$f":"IF(AND(N17>0,N18>0),IF(OR(N17>10,N17<0,N18>10,N18<0),\"Fehler\",IF(ABS(L17)-ABS(M17)-(N17+N18)/2+10>0,IF(L17<0,-(ABS(L17)-ABS(M17)-(N17+N18)/2+10),L17-ABS(M17)-(N17+N18)/2+10),0)),0)","v":0},7,null,2.9,{"$f":"IF(AND(R17>0,R18>0),IF(OR(R17>10,R17<0,R18>10,R18<0),\"Fehler\",IF(ABS(P17)-ABS(Q17)-(R17+R18)/2+10>0,IF(P17<0,-(ABS(P17)-ABS(Q17)-(R17+R18)/2+10),P17-ABS(Q17)-(R17+R18)/2+10),0)),0)","v":14.1},null,null,null,{"$f":"IF(AND(V17>0,V18>0),IF(OR(V17>10,V17<0,V18>10,V18<0),\"Fehler\",IF(ABS(T17)-ABS(U17)-(V17+V18)/2+10>0,IF(T17<0,-(ABS(T17)-ABS(U17)-(V17+V18)/2+10),T17-ABS(U17)-(V17+V18)/2+10),0)),0)","v":0},5,null,1.8,{"$f":"IF(AND(Z17>0,Z18>0),IF(OR(Z17>10,Z17<0,Z18>10,Z18<0),\"Fehler\",IF(ABS(X17)-ABS(Y17)-(Z17+Z18)/2+10>0,IF(X17<0,-(ABS(X17)-ABS(Y17)-(Z17+Z18)/2+10),X17-ABS(Y17)-(Z17+Z18)/2+10),0)),0)","v":13.4},{"$f":"ABS(G17)+ABS(K17)+ABS(O17)+ABS(S17)+ABS(W17)+ABS(AA17)","v":55.949999999999996}]
[null,null,null,null,null,2.1,null,null,null,2.6,null,null,null,null,null,null,null,2.9,null,null,null,null,null,null,null,1.4,null,null,null,null,null,"Gesamt",{"$f":"SUM(AG11:AG17)","v":6}]
["Jannis Volkmer",{"$f":"IF(A19>0,B17,\"\")","v":"TG Oker Salzgitter 1"},{"$f":"IF(A19<>\"\", VLOOKUP(A19,'Wertungszettel M3'!A$7:B$40,2,0),\"\")","v":"05"},null,null,null,{"$f":"IF(AND(F19>0,F20>0),IF(OR(F19>10,F19<0,F20>10,F20<0),\"Fehler\",IF(ABS(D19)-ABS(E19)-(F19+F20)/2+10>0,IF(D19<0,-(ABS(D19)-ABS(E19)-(F19+F20)/2+10),D19-ABS(E19)-(F19+F20)/2+10),0)),0)","v":0},null,null,null,{"$f":"IF(AND(J19>0,J20>0),IF(OR(J19>10,J19<0,J20>10,J20<0),\"Fehler\",IF(ABS(H19)-ABS(I19)-(J19+J20)/2+10>0,IF(H19<0,-(ABS(H19)-ABS(I19)-(J19+J20)/2+10),H19-ABS(I19)-(J19+J20)/2+10),0)),0)","v":0},null,null,null,{"$f":"IF(AND(N19>0,N20>0),IF(OR(N19>10,N19<0,N20>10,N20<0),\"Fehler\",IF(ABS(L19)-ABS(M19)-(N19+N20)/2+10>0,IF(L19<0,-(ABS(L19)-ABS(M19)-(N19+N20)/2+10),L19-ABS(M19)-(N19+N20)/2+10),0)),0)","v":0},null,null,null,{"$f":"IF(AND(R19>0,R20>0),IF(OR(R19>10,R19<0,R20>10,R20<0),\"Fehler\",IF(ABS(P19)-ABS(Q19)-(R19+R20)/2+10>0,IF(P19<0,-(ABS(P19)-ABS(Q19)-(R19+R20)/2+10),P19-ABS(Q19)-(R19+R20)/2+10),0)),0)","v":0},null,null,null,{"$f":"IF(AND(V19>0,V20>0),IF(OR(V19>10,V19<0,V20>10,V20<0),\"Fehler\",IF(ABS(T19)-ABS(U19)-(V19+V20)/2+10>0,IF(T19<0,-(ABS(T19)-ABS(U19)-(V19+V20)/2+10),T19-ABS(U19)-(V19+V20)/2+10),0)),0)","v":0},null,null,null,{"$f":"IF(AND(Z19>0,Z20>0),IF(OR(Z19>10,Z19<0,Z20>10,Z20<0),\"Fehler\",IF(ABS(X19)-ABS(Y19)-(Z19+Z20)/2+10>0,IF(X19<0,-(ABS(X19)-ABS(Y19)-(Z19+Z20)/2+10),X19-ABS(Y19)-(Z19+Z20)/2+10),0)),0)","v":0},{"$f":"ABS(G19)+ABS(K19)+ABS(O19)+ABS(S19)+ABS(W19)+ABS(AA19)","v":0}]
[]
["Christian Rath",{"$f":"IF(A21>0,B19,\"\")","v":"TG Oker Salzgitter 1"},{"$f":"IF(A21<>\"\", VLOOKUP(A21,'Wertungszettel M3'!A$7:B$40,2,0),\"\")","v":"06"},6,null,2.1,{"$f":"IF(AND(F21>0,F22>0),IF(OR(F21>10,F21<0,F22>10,F22<0),\"Fehler\",IF(ABS(D21)-ABS(E21)-(F21+F22)/2+10>0,IF(D21<0,-(ABS(D21)-ABS(E21)-(F21+F22)/2+10),D21-ABS(E21)-(F21+F22)/2+10),0)),0)","v":13.8},null,null,null,{"$f":"IF(AND(J21>0,J22>0),IF(OR(J21>10,J21<0,J22>10,J22<0),\"Fehler\",IF(ABS(H21)-ABS(I21)-(J21+J22)/2+10>0,IF(H21<0,-(ABS(H21)-ABS(I21)-(J21+J22)/2+10),H21-ABS(I21)-(J21+J22)/2+10),0)),0)","v":0},6,null,2.2000000000000002,{"$f":"IF(AND(N21>0,N22>0),IF(OR(N21>10,N21<0,N22>10,N22<0),\"Fehler\",IF(ABS(L21)-ABS(M21)-(N21+N22)/2+10>0,IF(L21<0,-(ABS(L21)-ABS(M21)-(N21+N22)/2+10),L21-ABS(M21)-(N21+N22)/2+10),0)),0)","v":13.8},7,null,2,{"$f":"IF(AND(R21>0,R22>0),IF(OR(R21>10,R21<0,R22>10,R22<0),\"Fehler\",IF(ABS(P21)-ABS(Q21)-(R21+R22)/2+10>0,IF(P21<0,-(ABS(P21)-ABS(Q21)-(R21+R22)/2+10),P21-ABS(Q21)-(R21+R22)/2+10),0)),0)","v":14.9},6,null,3.8,{"$f":"IF(AND(V21>0,V22>0),IF(OR(V21>10,V21<0,V22>10,V22<0),\"Fehler\",IF(ABS(T21)-ABS(U21)-(V21+V22)/2+10>0,IF(T21<0,-(ABS(T21)-ABS(U21)-(V21+V22)/2+10),T21-ABS(U21)-(V21+V22)/2+10),0)),0)","v":12.3},null,null,null,{"$f":"IF(AND(Z21>0,Z22>0),IF(OR(Z21>10,Z21<0,Z22>10,Z22<0),\"Fehler\",IF(ABS(X21)-ABS(Y21)-(Z21+Z22)/2+10>0,IF(X21<0,-(ABS(X21)-ABS(Y21)-(Z21+Z22)/2+10),X21-ABS(Y21)-(Z21+Z22)/2+10),0)),0)","v":0},{"$f":"ABS(G21)+ABS(K21)+ABS(O21)+ABS(S21)+ABS(W21)+ABS(AA21)","v":54.8}]
[null,null,null,null,null,2.2999999999999998,null,null,null,null,null,null,null,2.2000000000000002,null,null,null,2.2000000000000002,null,null,null,3.6]
[null,{"$f":"IF(A23>0,B21,\"\")","v":""},{"$f":"IF(A23<>\"\", VLOOKUP(A23,'Wertungszettel M3'!A$7:B$40,2,0),\"\")","v":""},null,null,null,{"$f":"IF(AND(F23>0,F24>0),IF(OR(F23>10,F23<0,F24>10,F24<0),\"Fehler\",IF(ABS(D23)-ABS(E23)-(F23+F24)/2+10>0,IF(D23<0,-(ABS(D23)-ABS(E23)-(F23+F24)/2+10),D23-ABS(E23)-(F23+F24)/2+10),0)),0)","v":0},null,null,null,{"$f":"IF(AND(J23>0,J24>0),IF(OR(J23>10,J23<0,J24>10,J24<0),\"Fehler\",IF(ABS(H23)-ABS(I23)-(J23+J24)/2+10>0,IF(H23<0,-(ABS(H23)-ABS(I23)-(J23+J24)/2+10),H23-ABS(I23)-(J23+J24)/2+10),0)),0)","v":0},null,null,null,{"$f":"IF(AND(N23>0,N24>0),IF(OR(N23>10,N23<0,N24>10,N24<0),\"Fehler\",IF(ABS(L23)-ABS(M23)-(N23+N24)/2+10>0,IF(L23<0,-(ABS(L23)-ABS(M23)-(N23+N24)/2+10),L23-ABS(M23)-(N23+N24)/2+10),0)),0)","v":0},null,null,null,{"$f":"IF(AND(R23>0,R24>0),IF(OR(R23>10,R23<0,R24>10,R24<0),\"Fehler\",IF(ABS(P23)-ABS(Q23)-(R23+R24)/2+10>0,IF(P23<0,-(ABS(P23)-ABS(Q23)-(R23+R24)/2+10),P23-ABS(Q23)-(R23+R24)/2+10),0)),0)","v":0},null,null,null,{"$f":"IF(AND(V23>0,V24>0),IF(OR(V23>10,V23<0,V24>10,V24<0),\"Fehler\",IF(ABS(T23)-ABS(U23)-(V23+V24)/2+10>0,IF(T23<0,-(ABS(T23)-ABS(U23)-(V23+V24)/2+10),T23-ABS(U23)-(V23+V24)/2+10),0)),0)","v":0},null,null,null,{"$f":"IF(AND(Z23>0,Z24>0),IF(OR(Z23>10,Z23<0,Z24>10,Z24<0),\"Fehler\",IF(ABS(X23)-ABS(Y23)-(Z23+Z24)/2+10>0,IF(X23<0,-(ABS(X23)-ABS(Y23)-(Z23+Z24)/2+10),X23-ABS(Y23)-(Z23+Z24)/2+10),0)),0)","v":0},{"$f":"ABS(G23)+ABS(K23)+ABS(O23)+ABS(S23)+ABS(W23)+ABS(AA23)","v":0}]
[]
[null,{"$f":"IF(A25>0,B23,\"\")","v":""},{"$f":"IF(A25<>\"\", VLOOKUP(A25,'Wertungszettel M3'!A$7:B$40,2,0),\"\")","v":""},null,null,null,{"$f":"IF(AND(F25>0,F26>0),IF(OR(F25>10,F25<0,F26>10,F26<0),\"Fehler\",IF(ABS(D25)-ABS(E25)-(F25+F26)/2+10>0,IF(D25<0,-(ABS(D25)-ABS(E25)-(F25+F26)/2+10),D25-ABS(E25)-(F25+F26)/2+10),0)),0)","v":0},null,null,null,{"$f":"IF(AND(J25>0,J26>0),IF(OR(J25>10,J25<0,J26>10,J26<0),\"Fehler\",IF(ABS(H25)-ABS(I25)-(J25+J26)/2+10>0,IF(H25<0,-(ABS(H25)-ABS(I25)-(J25+J26)/2+10),H25-ABS(I25)-(J25+J26)/2+10),0)),0)","v":0},null,null,null,{"$f":"IF(AND(N25>0,N26>0),IF(OR(N25>10,N25<0,N26>10,N26<0),\"Fehler\",IF(ABS(L25)-ABS(M25)-(N25+N26)/2+10>0,IF(L25<0,-(ABS(L25)-ABS(M25)-(N25+N26)/2+10),L25-ABS(M25)-(N25+N26)/2+10),0)),0)","v":0},null,null,null,{"$f":"IF(AND(R25>0,R26>0),IF(OR(R25>10,R25<0,R26>10,R26<0),\"Fehler\",IF(ABS(P25)-ABS(Q25)-(R25+R26)/2+10>0,IF(P25<0,-(ABS(P25)-ABS(Q25)-(R25+R26)/2+10),P25-ABS(Q25)-(R25+R26)/2+10),0)),0)","v":0},null,null,null,{"$f":"IF(AND(V25>0,V26>0),IF(OR(V25>10,V25<0,V26>10,V26<0),\"Fehler\",IF(ABS(T25)-ABS(U25)-(V25+V26)/2+10>0,IF(T25<0,-(ABS(T25)-ABS(U25)-(V25+V26)/2+10),T25-ABS(U25)-(V25+V26)/2+10),0)),0)","v":0},null,null,null,{"$f":"IF(AND(Z25>0,Z26>0),IF(OR(Z25>10,Z25<0,Z26>10,Z26<0),\"Fehler\",IF(ABS(X25)-ABS(Y25)-(Z25+Z26)/2+10>0,IF(X25<0,-(ABS(X25)-ABS(Y25)-(Z25+Z26)/2+10),X25-ABS(Y25)-(Z25+Z26)/2+10),0)),0)","v":0},{"$f":"ABS(G25)+ABS(K25)+ABS(O25)+ABS(S25)+ABS(W25)+ABS(AA25)","v":0}]
[]
[null,{"$f":"IF(A27>0,B25,\"\")","v":""},{"$f":"IF(A27<>\"\", VLOOKUP(A27,'Wertungszettel M3'!A$7:B$40,2,0),\"\")","v":""},null,null,null,{"$f":"IF(AND(F27>0,F28>0),IF(OR(F27>10,F27<0,F28>10,F28<0),\"Fehler\",IF(ABS(D27)-ABS(E27)-(F27+F28)/2+10>0,IF(D27<0,-(ABS(D27)-ABS(E27)-(F27+F28)/2+10),D27-ABS(E27)-(F27+F28)/2+10),0)),0)","v":0},null,null,null,{"$f":"IF(AND(J27>0,J28>0),IF(OR(J27>10,J27<0,J28>10,J28<0),\"Fehler\",IF(ABS(H27)-ABS(I27)-(J27+J28)/2+10>0,IF(H27<0,-(ABS(H27)-ABS(I27)-(J27+J28)/2+10),H27-ABS(I27)-(J27+J28)/2+10),0)),0)","v":0},null,null,null,{"$f":"IF(AND(N27>0,N28>0),IF(OR(N27>10,N27<0,N28>10,N28<0),\"Fehler\",IF(ABS(L27)-ABS(M27)-(N27+N28)/2+10>0,IF(L27<0,-(ABS(L27)-ABS(M27)-(N27+N28)/2+10),L27-ABS(M27)-(N27+N28)/2+10),0)),0)","v":0},null,null,null,{"$f":"IF(AND(R27>0,R28>0),IF(OR(R27>10,R27<0,R28>10,R28<0),\"Fehler\",IF(ABS(P27)-ABS(Q27)-(R27+R28)/2+10>0,IF(P27<0,-(ABS(P27)-ABS(Q27)-(R27+R28)/2+10),P27-ABS(Q27)-(R27+R28)/2+10),0)),0)","v":0},null,null,null,{"$f":"IF(AND(V27>0,V28>0),IF(OR(V27>10,V27<0,V28>10,V28<0),\"Fehler\",IF(ABS(T27)-ABS(U27)-(V27+V28)/2+10>0,IF(T27<0,-(ABS(T27)-ABS(U27)-(V27+V28)/2+10),T27-ABS(U27)-(V27+V28)/2+10),0)),0)","v":0},null,null,null,{"$f":"IF(AND(Z27>0,Z28>0),IF(OR(Z27>10,Z27<0,Z28>10,Z28<0),\"Fehler\",IF(ABS(X27)-ABS(Y27)-(Z27+Z28)/2+10>0,IF(X27<0,-(ABS(X27)-ABS(Y27)-(Z27+Z28)/2+10),X27-ABS(Y27)-(Z27+Z28)/2+10),0)),0)","v":0},{"$f":"ABS(G27)+ABS(K27)+ABS(O27)+ABS(S27)+ABS(W27)+ABS(AA27)","v":0}]
[]
[]
[null,null,null,null,null,null,{"$f":"SUM(LARGE(G9:G28,1),LARGE(G9:G28,2),LARGE(G9:G28,3))","v":44.5},null,null,null,{"$f":"SUM(LARGE(K9:K28,1),LARGE(K9:K28,2),LARGE(K9:K28,3))","v":45.8},null,null,null,{"$f":"SUM(LARGE(O9:O28,1),LARGE(O9:O28,2),LARGE(O9:O28,3))","v":45.5},null,null,null,{"$f":"SUM(LARGE(S9:S28,1),LARGE(S9:S28,2),LARGE(S9:S28,3))","v":46.800000000000004},null,null,null,{"$f":"SUM(LARGE(W9:W28,1),LARGE(W9:W28,2),LARGE(W9:W28,3))","v":44.65},null,null,null,{"$f":"SUM(LARGE(AA9:AA28,1),LARGE(AA9:AA28,2),LARGE(AA9:AA28,3))","v":43.1},{"$f":"SUM(G30,K30,O30,S30,W30,AA30)","v":270.35000000000002}]

{"sheet":"TG Oker SZ 2","index":6,"n_rows":30,"n_cols":33,"rows_kept":30,"cut":false,"hidden":false,"merged":[[6,19,6,22],[6,23,6,26],[0,12,0,13],[2,0,2,1],[2,5,2,7],[2,12,2,13],[8,0,9,0],[8,1,9,1],[8,2,9,2],[8,3,9,3],[8,4,9,4],[6,3,6,6],[6,7,6,10],[6,11,6,14],[6,15,6,18],[8,6,9,6],[8,7,9,7],[8,8,9,8],[8,10,9,10],[8,11,9,11],[8,12,9,12],[4,14,4,16],[10,23,11,23],[10,24,11,24],[10,26,11,26],[8,22,9,22],[8,23,9,23],[8,24,9,24],[8,26,9,26],[8,27,9,27],[8,14,9,14],[8,15,9,15],[8,16,9,16],[8,18,9,18],[8,19,9,19],[8,20,9,20],[10,27,11,27],[10,22,11,22],[10,20,11,20],[12,0,13,0],[12,1,13,1],[12,2,13,2],[12,3,13,3],[10,14,11,14],[10,16,11,16],[10,18,11,18],[10,19,11,19],[12,4,13,4],[12,6,13,6],[12,7,13,7],[12,8,13,8],[10,6,11,6],[10,7,11,7],[10,8,11,8],[10,10,11,10],[10,11,11,11],[10,12,11,12],[10,0,11,0],[10,1,11,1],[10,2,11,2],[10,3,11,3],[10,4,11,4],[12,20,13,20],[12,22,13,22],[12,23,13,23],[12,24,13,24],[12,26,13,26],[14,26,15,26],[12,27,13,27],[12,12,13,12],[12,14,13,14],[12,15,13,15],[12,16,13,16],[12,18,13,18],[12,19,13,19],[14,27,15,27],[14,22,15,22],[14,23,15,23],[14,24,15,24],[16,0,17,0],[16,1,17,1],[16,2,17,2],[16,3,17,3],[16,4,17,4],[16,6,17,6],[14,18,15,18],[14,19,15,19],[14,20,15,20],[14,10,15,10],[14,11,15,11],[14,12,15,12],[14,14,15,14],[14,15,15,15],[14,16,15,16],[14,0,15,0],[14,1,15,1],[14,2,15,2],[14,3,15,3],[14,4,15,4],[14,6,15,6],[14,7,15,7],[14,8,15,8],[16,23,17,23],[16,24,17,24],[16,26,17,26],[16,27,17,27],[18,0,19,0],[18,1,19,1],[18,2,19,2],[18,3,19,3],[16,15,17,15],[16,16,17,16],[16,18,17,18],[16,19,17,19],[16,20,17,20],[16,22,17,22],[16,7,17,7],[16,8,17,8],[16,10,17,10],[16,11,17,11],[16,12,17,12],[16,14,17,14],[18,27,19,27],[18,12,19,12],[18,14,19,14],[18,15,19,15],[18,20,19,20],[18,22,19,22],[18,23,19,23],[18,24,19,24],[18,16,19,16],[18,18,19,18],[18,19,19,19],[18,4,19,4],[18,6,19,6],[18,7,19,7],[18,8,19,8],[18,10,19,10],[18,11,19,11],[18,26,19,26],[20,26,21,26],[20,27,21,27],[22,0,23,0],[22,1,23,1],[22,2,23,2],[22,3,23,3],[22,4,23,4],[22,6,23,6],[20,18,21,18],[20,19,21,19],[20,20,21,20],[20,22,21,22],[20,23,21,23],[20,24,21,24],[20,10,21,10],[20,11,21,11],[20,12,21,12],[20,14,21,14],[20,15,21,15],[22,23,23,23],[22,24,23,24],[22,26,23,26],[22,27,23,27],[22,22,23,22],[22,7,23,7],[22,8,23,8],[22,10,23,10],[22,11,23,11],[22,12,23,12],[22,14,23,14],[24,22,25,22],[24,23,25,23],[24,7,25,7],[24,8,25,8],[24,10,25,10],[24,11,25,11],[22,15,23,15],[22,16,23,16],[22,18,23,18],[22,19,23,19],[22,20,23,20],[24,24,25,24],[24,26,25,26],[26,26,27,26],[24,27,25,27],[24,12,25,12],[24,14,25,14],[24,15,25,15],[24,16,25,16],[24,18,25,18],[24,19,25,19],[26,27,27,27],[26,22,27,22],[26,23,27,23],[26,24,27,24],[24,20,25,20],[26,18,27,18],[26,19,27,19],[26,20,27,20],[26,10,27,10],[26,11,27,11],[26,12,27,12],[26,14,27,14],[26,15,27,15],[26,16,27,16],[2,14,2,16],[0,14,0,16],[10,15,11,15],[12,10,13,10],[20,16,21,16],[12,11,13,11],[26,0,27,0],[26,1,27,1],[26,2,27,2],[26,3,27,3],[26,4,27,4],[26,6,27,6],[26,7,27,7],[26,8,27,8],[20,0,21,0],[20,1,21,1],[20,2,21,2],[20,3,21,3],[24,0,25,0],[24,1,25,1],[24,2,25,2],[24,3,25,3],[24,4,25,4],[24,6,25,6],[20,4,21,4],[20,6,21,6],[20,7,21,7],[20,8,21,8]]}
["Wettkampfbogen",null,null,null,null,null,null,null,null,null,null,null,"Datum:",null,{"$f":"'INFO Blatt'!B13","v":"2018-03-03"}]
[]
[null,null,null,null,null,null,null,null,null,null,null,null,"Ort:",null,{"$f":"'INFO Blatt'!B11","v":"Hehlen"}]
[]
[null,null,null,null,null,null,null,null,null,null,null,null,null,"Liga:",{"$f":"'INFO Blatt'!B7","v":"Schülerliga Süd"}]
[]
["Name","Verein","Jg","Boden",null,null,null,"Pferd",null,null,null,"Ringe",null,null,null,"Sprung",null,null,null,"Barren",null,null,null,"Reck",null,null,null,"Ges."]
[null,null,null,"D-Note","Abzug OK","E- Abzug","Note","D-Note","Abzug OK","E- Abzug","Note","D-Note","Abzug OK","E-Abzug","Note","D-Note","Abzug OK","E-Abzug","Note","D-Note","Abzug OK","E-Abzug","Note","D-Note","Abzug OK","E-Abzug","Note"]
["Patrick Gernowski",{"$f":"Formeln!A8","v":"TG Oker Salzgitter 2"},{"$f":"IF(A9<>\"\", VLOOKUP(A9,'Wertungszettel M4'!A$7:B$36,2,0),\"\")","v":"04"},5,0.5,2.2000000000000002,{"$f":"IF(AND(F9>0,F10>0),IF(OR(F9>10,F9<0,F10>10,F10<0),\"Fehler\",IF(ABS(D9)-ABS(E9)-(F9+F10)/2+10>0,IF(D9<0,-(ABS(D9)-ABS(E9)-(F9+F10)/2+10),D9-ABS(E9)-(F9+F10)/2+10),0)),0)","v":12},5,null,3.3,{"$f":"IF(AND(J9>0,J10>0),IF(OR(J9>10,J9<0,J10>10,J10<0),\"Fehler\",IF(ABS(H9)-ABS(I9)-(J9+J10)/2+10>0,IF(H9<0,-(ABS(H9)-ABS(I9)-(J9+J10)/2+10),H9-ABS(I9)-(J9+J10)/2+10),0)),0)","v":11.7},5,1.5,2.7,{"$f":"IF(AND(N9>0,N10>0),IF(OR(N9>10,N9<0,N10>10,N10<0),\"Fehler\",IF(ABS(L9)-ABS(M9)-(N9+N10)/2+10>0,IF(L9<0,-(ABS(L9)-ABS(M9)-(N9+N10)/2+10),L9-ABS(M9)-(N9+N10)/2+10),0)),0)","v":10.7},7,null,2.1,{"$f":"IF(AND(R9>0,R10>0),IF(OR(R9>10,R9<0,R10>10,R10<0),\"Fehler\",IF(ABS(P9)-ABS(Q9)-(R9+R10)/2+10>0,IF(P9<0,-(ABS(P9)-ABS(Q9)-(R9+R10)/2+10),P9-ABS(Q9)-(R9+R10)/2+10),0)),0)","v":14.9},5,null,3.1,{"$f":"IF(AND(V9>0,V10>0),IF(OR(V9>10,V9<0,V10>10,V10<0),\"Fehler\",IF(ABS(T9)-ABS(U9)-(V9+V10)/2+10>0,IF(T9<0,-(ABS(T9)-ABS(U9)-(V9+V10)/2+10),T9-ABS(U9)-(V9+V10)/2+10),0)),0)","v":11.9},5,null,2.6,{"$f":"IF(AND(Z9>0,Z10>0),IF(OR(Z9>10,Z9<0,Z10>10,Z10<0),\"Fehler\",IF(ABS(X9)-ABS(Y9)-(Z9+Z10)/2+10>0,IF(X9<0,-(ABS(X9)-ABS(Y9)-(Z9+Z10)/2+10),X9-ABS(Y9)-(Z9+Z10)/2+10),0)),0)","v":12.35},{"$f":"ABS(G9)+ABS(K9)+ABS(O9)+ABS(S9)+ABS(W9)+ABS(AA9)","v":73.55}]
[null,null,null,null,null,2.8,null,null,null,3.3,null,null,null,2.9,null,null,null,2.1,null,null,null,3.1,null,null,null,2.7]
["Jamie Schnabel",{"$f":"IF(A11>0,B9,\"\")","v":"TG Oker Salzgitter 2"},{"$f":"IF(A11<>\"\", VLOOKUP(A11,'Wertungszettel M4'!A$7:B$36,2,0),\"\")","v":"05"},5,null,2.5,{"$f":"IF(AND(F11>0,F12>0),IF(OR(F11>10,F11<0,F12>10,F12<0),\"Fehler\",IF(ABS(D11)-ABS(E11)-(F11+F12)/2+10>0,IF(D11<0,-(ABS(D11)-ABS(E11)-(F11+F12)/2+10),D11-ABS(E11)-(F11+F12)/2+10),0)),0)","v":12.4},5,null,3.6,{"$f":"IF(AND(J11>0,J12>0),IF(OR(J11>10,J11<0,J12>10,J12<0),\"Fehler\",IF(ABS(H11)-ABS(I11)-(J11+J12)/2+10>0,IF(H11<0,-(ABS(H11)-ABS(I11)-(J11+J12)/2+10),H11-ABS(I11)-(J11+J12)/2+10),0)),0)","v":11.5},5,0.5,2.8,{"$f":"IF(AND(N11>0,N12>0),IF(OR(N11>10,N11<0,N12>10,N12<0),\"Fehler\",IF(ABS(L11)-ABS(M11)-(N11+N12)/2+10>0,IF(L11<0,-(ABS(L11)-ABS(M11)-(N11+N12)/2+10),L11-ABS(M11)-(N11+N12)/2+10),0)),0)","v":11.7},5,null,0.9,{"$f":"IF(AND(R11>0,R12>0),IF(OR(R11>10,R11<0,R12>10,R12<0),\"Fehler\",IF(ABS(P11)-ABS(Q11)-(R11+R12)/2+10>0,IF(P11<0,-(ABS(P11)-ABS(Q11)-(R11+R12)/2+10),P11-ABS(Q11)-(R11+R12)/2+10),0)),0)","v":14.1},5,null,3.4,{"$f":"IF(AND(V11>0,V12>0),IF(OR(V11>10,V11<0,V12>10,V12<0),\"Fehler\",IF(ABS(T11)-ABS(U11)-(V11+V12)/2+10>0,IF(T11<0,-(ABS(T11)-ABS(U11)-(V11+V12)/2+10),T11-ABS(U11)-(V11+V12)/2+10),0)),0)","v":11.5},5,null,2.4,{"$f":"IF(AND(Z11>0,Z12>0),IF(OR(Z11>10,Z11<0,Z12>10,Z12<0),\"Fehler\",IF(ABS(X11)-ABS(Y11)-(Z11+Z12)/2+10>0,IF(X11<0,-(ABS(X11)-ABS(Y11)-(Z11+Z12)/2+10),X11-ABS(Y11)-(Z11+Z12)/2+10),0)),0)","v":12.45},{"$f":"ABS(G11)+ABS(K11)+ABS(O11)+ABS(S11)+ABS(W11)+ABS(AA11)","v":73.649999999999991},null,null,null,"Boden",{"$f":"IF(G30>1,1,0)","v":1}]
[null,null,null,null,null,2.7,null,null,null,3.4,null,null,null,2.8,null,null,null,0.9,null,null,null,3.6,null,null,null,2.7,null,null,null,null,null,"pauschenpferd",{"$f":"IF(K30>1,1,0)","v":1}]
["Emmanuel Taube",{"$f":"IF(A13>0,B11,\"\")","v":"TG Oker Salzgitter 2"},{"$f":"IF(A13<>\"\", VLOOKUP(A13,'Wertungszettel M4'!A$7:B$36,2,0),\"\")","v":"05"},5,null,2.4,{"$f":"IF(AND(F13>0,F14>0),IF(OR(F13>10,F13<0,F14>10,F14<0),\"Fehler\",IF(ABS(D13)-ABS(E13)-(F13+F14)/2+10>0,IF(D13<0,-(ABS(D13)-ABS(E13)-(F13+F14)/2+10),D13-ABS(E13)-(F13+F14)/2+10),0)),0)","v":12.5},6,null,3.9,{"$f":"IF(AND(J13>0,J14>0),IF(OR(J13>10,J13<0,J14>10,J14<0),\"Fehler\",IF(ABS(H13)-ABS(I13)-(J13+J14)/2+10>0,IF(H13<0,-(ABS(H13)-ABS(I13)-(J13+J14)/2+10),H13-ABS(I13)-(J13+J14)/2+10),0)),0)","v":12.05},5,null,2.5,{"$f":"IF(AND(N13>0,N14>0),IF(OR(N13>10,N13<0,N14>10,N14<0),\"Fehler\",IF(ABS(L13)-ABS(M13)-(N13+N14)/2+10>0,IF(L13<0,-(ABS(L13)-ABS(M13)-(N13+N14)/2+10),L13-ABS(M13)-(N13+N14)/2+10),0)),0)","v":12.4},7,null,2.4,{"$f":"IF(AND(R13>0,R14>0),IF(OR(R13>10,R13<0,R14>10,R14<0),\"Fehler\",IF(ABS(P13)-ABS(Q13)-(R13+R14)/2+10>0,IF(P13<0,-(ABS(P13)-ABS(Q13)-(R13+R14)/2+10),P13-ABS(Q13)-(R13+R14)/2+10),0)),0)","v":14.55},5,null,2.6,{"$f":"IF(AND(V13>0,V14>0),IF(OR(V13>10,V13<0,V14>10,V14<0),\"Fehler\",IF(ABS(T13)-ABS(U13)-(V13+V14)/2+10>0,IF(T13<0,-(ABS(T13)-ABS(U13)-(V13+V14)/2+10),T13-ABS(U13)-(V13+V14)/2+10),0)),0)","v":12.45},5,null,1.8,{"$f":"IF(AND(Z13>0,Z14>0),IF(OR(Z13>10,Z13<0,Z14>10,Z14<0),\"Fehler\",IF(ABS(X13)-ABS(Y13)-(Z13+Z14)/2+10>0,IF(X13<0,-(ABS(X13)-ABS(Y13)-(Z13+Z14)/2+10),X13-ABS(Y13)-(Z13+Z14)/2+10),0)),0)","v":12.9},{"$f":"ABS(G13)+ABS(K13)+ABS(O13)+ABS(S13)+ABS(W13)+ABS(AA13)","v":76.850000000000009},null,null,null,"ringe",{"$f":"IF(O30>1,1,0)","v":1}]
[null,null,null,null,null,2.6,null,null,null,4,null,null,null,2.7,null,null,null,2.5,null,null,null,2.5,null,null,null,2.4,null,null,null,null,null,"sprung",{"$f":"IF(S30>1,1,0)","v":1}]
["Eric Siebenhaar",{"$f":"IF(A15>0,B13,\"\")","v":"TG Oker Salzgitter 2"},{"$f":"IF(A15<>\"\", VLOOKUP(A15,'Wertungszettel M4'!A$7:B$36,2,0),\"\")","v":"07"},5,null,1.6,{"$f":"IF(AND(F15>0,F16>0),IF(OR(F15>10,F15<0,F16>10,F16<0),\"Fehler\",IF(ABS(D15)-ABS(E15)-(F15+F16)/2+10>0,IF(D15<0,-(ABS(D15)-ABS(E15)-(F15+F16)/2+10),D15-ABS(E15)-(F15+F16)/2+10),0)),0)","v":13.3},5,null,3.4,{"$f":"IF(AND(J15>0,J16>0),IF(OR(J15>10,J15<0,J16>10,J16<0),\"Fehler\",IF(ABS(H15)-ABS(I15)-(J15+J16)/2+10>0,IF(H15<0,-(ABS(H15)-ABS(I15)-(J15+J16)/2+10),H15-ABS(I15)-(J15+J16)/2+10),0)),0)","v":11.55},6,0.5,2.9,{"$f":"IF(AND(N15>0,N16>0),IF(OR(N15>10,N15<0,N16>10,N16<0),\"Fehler\",IF(ABS(L15)-ABS(M15)-(N15+N16)/2+10>0,IF(L15<0,-(ABS(L15)-ABS(M15)-(N15+N16)/2+10),L15-ABS(M15)-(N15+N16)/2+10),0)),0)","v":12.6},7,null,1.6,{"$f":"IF(AND(R15>0,R16>0),IF(OR(R15>10,R15<0,R16>10,R16<0),\"Fehler\",IF(ABS(P15)-ABS(Q15)-(R15+R16)/2+10>0,IF(P15<0,-(ABS(P15)-ABS(Q15)-(R15+R16)/2+10),P15-ABS(Q15)-(R15+R16)/2+10),0)),0)","v":15.3},6,null,2.5,{"$f":"IF(AND(V15>0,V16>0),IF(OR(V15>10,V15<0,V16>10,V16<0),\"Fehler\",IF(ABS(T15)-ABS(U15)-(V15+V16)/2+10>0,IF(T15<0,-(ABS(T15)-ABS(U15)-(V15+V16)/2+10),T15-ABS(U15)-(V15+V16)/2+10),0)),0)","v":13.45},5,null,2.1,{"$f":"IF(AND(Z15>0,Z16>0),IF(OR(Z15>10,Z15<0,Z16>10,Z16<0),\"Fehler\",IF(ABS(X15)-ABS(Y15)-(Z15+Z16)/2+10>0,IF(X15<0,-(ABS(X15)-ABS(Y15)-(Z15+Z16)/2+10),X15-ABS(Y15)-(Z15+Z16)/2+10),0)),0)","v":12.85},{"$f":"ABS(G15)+ABS(K15)+ABS(O15)+ABS(S15)+ABS(W15)+ABS(AA15)","v":79.05},null,null,null,"Barren",{"$f":"IF(W30>1,1,0)","v":1}]
[null,null,null,null,null,1.8,null,null,null,3.5,null,null,null,2.9,null,null,null,1.8,null,null,null,2.6,null,null,null,2.2000000000000002,null,null,null,null,null,"Reck",{"$f":"IF(AA30>1,1,0)","v":1}]
["Lasse Sticka",{"$f":"IF(A17>0,B15,\"\")","v":"TG Oker Salzgitter 2"},{"$f":"IF(A17<>\"\", VLOOKUP(A17,'Wertungszettel M4'!A$7:B$36,2,0),\"\")","v":"07"},5,null,3.6,{"$f":"IF(AND(F17>0,F18>0),IF(OR(F17>10,F17<0,F18>10,F18<0),\"Fehler\",IF(ABS(D17)-ABS(E17)-(F17+F18)/2+10>0,IF(D17<0,-(ABS(D17)-ABS(E17)-(F17+F18)/2+10),D17-ABS(E17)-(F17+F18)/2+10),0)),0)","v":11.5},5,null,3.2,{"$f":"IF(AND(J17>0,J18>0),IF(OR(J17>10,J17<0,J18>10,J18<0),\"Fehler\",IF(ABS(H17)-ABS(I17)-(J17+J18)/2+10>0,IF(H17<0,-(ABS(H17)-ABS(I17)-(J17+J18)/2+10),H17-ABS(I17)-(J17+J18)/2+10),0)),0)","v":11.9},null,null,null,{"$f":"IF(AND(N17>0,N18>0),IF(OR(N17>10,N17<0,N18>10,N18<0),\"Fehler\",IF(ABS(L17)-ABS(M17)-(N17+N18)/2+10>0,IF(L17<0,-(ABS(L17)-ABS(M17)-(N17+N18)/2+10),L17-ABS(M17)-(N17+N18)/2+10),0)),0)","v":0},5,null,0.9,{"$f":"IF(AND(R17>0,R18>0),IF(OR(R17>10,R17<0,R18>10,R18<0),\"Fehler\",IF(ABS(P17)-ABS(Q17)-(R17+R18)/2+10>0,IF(P17<0,-(ABS(P17)-ABS(Q17)-(R17+R18)/2+10),P17-ABS(Q17)-(R17+R18)/2+10),0)),0)","v":14.1},5,null,2.4,{"$f":"IF(AND(V17>0,V18>0),IF(OR(V17>10,V17<0,V18>10,V18<0),\"Fehler\",IF(ABS(T17)-ABS(U17)-(V17+V18)/2+10>0,IF(T17<0,-(ABS(T17)-ABS(U17)-(V17+V18)/2+10),T17-ABS(U17)-(V17+V18)/2+10),0)),0)","v":12.65},5,null,2.7,{"$f":"IF(AND(Z17>0,Z18>0),IF(OR(Z17>10,Z17<0,Z18>10,Z18<0),\"Fehler\",IF(ABS(X17)-ABS(Y17)-(Z17+Z18)/2+10>0,IF(X17<0,-(ABS(X17)-ABS(Y17)-(Z17+Z18)/2+10),X17-ABS(Y17)-(Z17+Z18)/2+10),0)),0)","v":12.45},{"$f":"ABS(G17)+ABS(K17)+ABS(O17)+ABS(S17)+ABS(W17)+ABS(AA17)","v":62.599999999999994}]
[null,null,null,null,null,3.4,null,null,null,3,null,null,null,null,null,null,null,0.9,null,null,null,2.2999999999999998,null,null,null,2.4,null,null,null,null,null,"Gesamt",{"$f":"SUM(AG11:AG17)","v":6}]
[null,{"$f":"IF(A19>0,B17,\"\")","v":""},{"$f":"IF(A19<>\"\", VLOOKUP(A19,'Wertungszettel M4'!A$7:B$36,2,0),\"\")","v":""},null,null,null,{"$f":"IF(AND(F19>0,F20>0),IF(OR(F19>10,F19<0,F20>10,F20<0),\"Fehler\",IF(ABS(D19)-ABS(E19)-(F19+F20)/2+10>0,IF(D19<0,-(ABS(D19)-ABS(E19)-(F19+F20)/2+10),D19-ABS(E19)-(F19+F20)/2+10),0)),0)","v":0},null,null,null,{"$f":"IF(AND(J19>0,J20>0),IF(OR(J19>10,J19<0,J20>10,J20<0),\"Fehler\",IF(ABS(H19)-ABS(I19)-(J19+J20)/2+10>0,IF(H19<0,-(ABS(H19)-ABS(I19)-(J19+J20)/2+10),H19-ABS(I19)-(J19+J20)/2+10),0)),0)","v":0},null,null,null,{"$f":"IF(AND(N19>0,N20>0),IF(OR(N19>10,N19<0,N20>10,N20<0),\"Fehler\",IF(ABS(L19)-ABS(M19)-(N19+N20)/2+10>0,IF(L19<0,-(ABS(L19)-ABS(M19)-(N19+N20)/2+10),L19-ABS(M19)-(N19+N20)/2+10),0)),0)","v":0},null,null,null,{"$f":"IF(AND(R19>0,R20>0),IF(OR(R19>10,R19<0,R20>10,R20<0),\"Fehler\",IF(ABS(P19)-ABS(Q19)-(R19+R20)/2+10>0,IF(P19<0,-(ABS(P19)-ABS(Q19)-(R19+R20)/2+10),P19-ABS(Q19)-(R19+R20)/2+10),0)),0)","v":0},null,null,null,{"$f":"IF(AND(V19>0,V20>0),IF(OR(V19>10,V19<0,V20>10,V20<0),\"Fehler\",IF(ABS(T19)-ABS(U19)-(V19+V20)/2+10>0,IF(T19<0,-(ABS(T19)-ABS(U19)-(V19+V20)/2+10),T19-ABS(U19)-(V19+V20)/2+10),0)),0)","v":0},null,null,null,{"$f":"IF(AND(Z19>0,Z20>0),IF(OR(Z19>10,Z19<0,Z20>10,Z20<0),\"Fehler\",IF(ABS(X19)-ABS(Y19)-(Z19+Z20)/2+10>0,IF(X19<0,-(ABS(X19)-ABS(Y19)-(Z19+Z20)/2+10),X19-ABS(Y19)-(Z19+Z20)/2+10),0)),0)","v":0},{"$f":"ABS(G19)+ABS(K19)+ABS(O19)+ABS(S19)+ABS(W19)+ABS(AA19)","v":0}]
[]
[null,{"$f":"IF(A21>0,B19,\"\")","v":""},{"$f":"IF(A21<>\"\", VLOOKUP(A21,'Wertungszettel M4'!A$7:B$36,2,0),\"\")","v":""},null,null,null,{"$f":"IF(AND(F21>0,F22>0),IF(OR(F21>10,F21<0,F22>10,F22<0),\"Fehler\",IF(ABS(D21)-ABS(E21)-(F21+F22)/2+10>0,IF(D21<0,-(ABS(D21)-ABS(E21)-(F21+F22)/2+10),D21-ABS(E21)-(F21+F22)/2+10),0)),0)","v":0},null,null,null,{"$f":"IF(AND(J21>0,J22>0),IF(OR(J21>10,J21<0,J22>10,J22<0),\"Fehler\",IF(ABS(H21)-ABS(I21)-(J21+J22)/2+10>0,IF(H21<0,-(ABS(H21)-ABS(I21)-(J21+J22)/2+10),H21-ABS(I21)-(J21+J22)/2+10),0)),0)","v":0},null,null,null,{"$f":"IF(AND(N21>0,N22>0),IF(OR(N21>10,N21<0,N22>10,N22<0),\"Fehler\",IF(ABS(L21)-ABS(M21)-(N21+N22)/2+10>0,IF(L21<0,-(ABS(L21)-ABS(M21)-(N21+N22)/2+10),L21-ABS(M21)-(N21+N22)/2+10),0)),0)","v":0},null,null,null,{"$f":"IF(AND(R21>0,R22>0),IF(OR(R21>10,R21<0,R22>10,R22<0),\"Fehler\",IF(ABS(P21)-ABS(Q21)-(R21+R22)/2+10>0,IF(P21<0,-(ABS(P21)-ABS(Q21)-(R21+R22)/2+10),P21-ABS(Q21)-(R21+R22)/2+10),0)),0)","v":0},null,null,null,{"$f":"IF(AND(V21>0,V22>0),IF(OR(V21>10,V21<0,V22>10,V22<0),\"Fehler\",IF(ABS(T21)-ABS(U21)-(V21+V22)/2+10>0,IF(T21<0,-(ABS(T21)-ABS(U21)-(V21+V22)/2+10),T21-ABS(U21)-(V21+V22)/2+10),0)),0)","v":0},null,null,null,{"$f":"IF(AND(Z21>0,Z22>0),IF(OR(Z21>10,Z21<0,Z22>10,Z22<0),\"Fehler\",IF(ABS(X21)-ABS(Y21)-(Z21+Z22)/2+10>0,IF(X21<0,-(ABS(X21)-ABS(Y21)-(Z21+Z22)/2+10),X21-ABS(Y21)-(Z21+Z22)/2+10),0)),0)","v":0},{"$f":"ABS(G21)+ABS(K21)+ABS(O21)+ABS(S21)+ABS(W21)+ABS(AA21)","v":0}]
[]
[null,{"$f":"IF(A23>0,B21,\"\")","v":""},{"$f":"IF(A23<>\"\", VLOOKUP(A23,'Wertungszettel M4'!A$7:B$36,2,0),\"\")","v":""},null,null,null,{"$f":"IF(AND(F23>0,F24>0),IF(OR(F23>10,F23<0,F24>10,F24<0),\"Fehler\",IF(ABS(D23)-ABS(E23)-(F23+F24)/2+10>0,IF(D23<0,-(ABS(D23)-ABS(E23)-(F23+F24)/2+10),D23-ABS(E23)-(F23+F24)/2+10),0)),0)","v":0},null,null,null,{"$f":"IF(AND(J23>0,J24>0),IF(OR(J23>10,J23<0,J24>10,J24<0),\"Fehler\",IF(ABS(H23)-ABS(I23)-(J23+J24)/2+10>0,IF(H23<0,-(ABS(H23)-ABS(I23)-(J23+J24)/2+10),H23-ABS(I23)-(J23+J24)/2+10),0)),0)","v":0},null,null,null,{"$f":"IF(AND(N23>0,N24>0),IF(OR(N23>10,N23<0,N24>10,N24<0),\"Fehler\",IF(ABS(L23)-ABS(M23)-(N23+N24)/2+10>0,IF(L23<0,-(ABS(L23)-ABS(M23)-(N23+N24)/2+10),L23-ABS(M23)-(N23+N24)/2+10),0)),0)","v":0},null,null,null,{"$f":"IF(AND(R23>0,R24>0),IF(OR(R23>10,R23<0,R24>10,R24<0),\"Fehler\",IF(ABS(P23)-ABS(Q23)-(R23+R24)/2+10>0,IF(P23<0,-(ABS(P23)-ABS(Q23)-(R23+R24)/2+10),P23-ABS(Q23)-(R23+R24)/2+10),0)),0)","v":0},null,null,null,{"$f":"IF(AND(V23>0,V24>0),IF(OR(V23>10,V23<0,V24>10,V24<0),\"Fehler\",IF(ABS(T23)-ABS(U23)-(V23+V24)/2+10>0,IF(T23<0,-(ABS(T23)-ABS(U23)-(V23+V24)/2+10),T23-ABS(U23)-(V23+V24)/2+10),0)),0)","v":0},null,null,null,{"$f":"IF(AND(Z23>0,Z24>0),IF(OR(Z23>10,Z23<0,Z24>10,Z24<0),\"Fehler\",IF(ABS(X23)-ABS(Y23)-(Z23+Z24)/2+10>0,IF(X23<0,-(ABS(X23)-ABS(Y23)-(Z23+Z24)/2+10),X23-ABS(Y23)-(Z23+Z24)/2+10),0)),0)","v":0},{"$f":"ABS(G23)+ABS(K23)+ABS(O23)+ABS(S23)+ABS(W23)+ABS(AA23)","v":0}]
[]
[null,{"$f":"IF(A25>0,B23,\"\")","v":""},{"$f":"IF(A25<>\"\", VLOOKUP(A25,'Wertungszettel M4'!A$7:B$36,2,0),\"\")","v":""},null,null,null,{"$f":"IF(AND(F25>0,F26>0),IF(OR(F25>10,F25<0,F26>10,F26<0),\"Fehler\",IF(ABS(D25)-ABS(E25)-(F25+F26)/2+10>0,IF(D25<0,-(ABS(D25)-ABS(E25)-(F25+F26)/2+10),D25-ABS(E25)-(F25+F26)/2+10),0)),0)","v":0},null,null,null,{"$f":"IF(AND(J25>0,J26>0),IF(OR(J25>10,J25<0,J26>10,J26<0),\"Fehler\",IF(ABS(H25)-ABS(I25)-(J25+J26)/2+10>0,IF(H25<0,-(ABS(H25)-ABS(I25)-(J25+J26)/2+10),H25-ABS(I25)-(J25+J26)/2+10),0)),0)","v":0},null,null,null,{"$f":"IF(AND(N25>0,N26>0),IF(OR(N25>10,N25<0,N26>10,N26<0),\"Fehler\",IF(ABS(L25)-ABS(M25)-(N25+N26)/2+10>0,IF(L25<0,-(ABS(L25)-ABS(M25)-(N25+N26)/2+10),L25-ABS(M25)-(N25+N26)/2+10),0)),0)","v":0},null,null,null,{"$f":"IF(AND(R25>0,R26>0),IF(OR(R25>10,R25<0,R26>10,R26<0),\"Fehler\",IF(ABS(P25)-ABS(Q25)-(R25+R26)/2+10>0,IF(P25<0,-(ABS(P25)-ABS(Q25)-(R25+R26)/2+10),P25-ABS(Q25)-(R25+R26)/2+10),0)),0)","v":0},null,null,null,{"$f":"IF(AND(V25>0,V26>0),IF(OR(V25>10,V25<0,V26>10,V26<0),\"Fehler\",IF(ABS(T25)-ABS(U25)-(V25+V26)/2+10>0,IF(T25<0,-(ABS(T25)-ABS(U25)-(V25+V26)/2+10),T25-ABS(U25)-(V25+V26)/2+10),0)),0)","v":0},null,null,null,{"$f":"IF(AND(Z25>0,Z26>0),IF(OR(Z25>10,Z25<0,Z26>10,Z26<0),\"Fehler\",IF(ABS(X25)-ABS(Y25)-(Z25+Z26)/2+10>0,IF(X25<0,-(ABS(X25)-ABS(Y25)-(Z25+Z26)/2+10),X25-ABS(Y25)-(Z25+Z26)/2+10),0)),0)","v":0},{"$f":"ABS(G25)+ABS(K25)+ABS(O25)+ABS(S25)+ABS(W25)+ABS(AA25)","v":0}]
[]
[null,{"$f":"IF(A27>0,B25,\"\")","v":""},{"$f":"IF(A27<>\"\", VLOOKUP(A27,'Wertungszettel M4'!A$7:B$36,2,0),\"\")","v":""},null,null,null,{"$f":"IF(AND(F27>0,F28>0),IF(OR(F27>10,F27<0,F28>10,F28<0),\"Fehler\",IF(ABS(D27)-ABS(E27)-(F27+F28)/2+10>0,IF(D27<0,-(ABS(D27)-ABS(E27)-(F27+F28)/2+10),D27-ABS(E27)-(F27+F28)/2+10),0)),0)","v":0},null,null,null,{"$f":"IF(AND(J27>0,J28>0),IF(OR(J27>10,J27<0,J28>10,J28<0),\"Fehler\",IF(ABS(H27)-ABS(I27)-(J27+J28)/2+10>0,IF(H27<0,-(ABS(H27)-ABS(I27)-(J27+J28)/2+10),H27-ABS(I27)-(J27+J28)/2+10),0)),0)","v":0},null,null,null,{"$f":"IF(AND(N27>0,N28>0),IF(OR(N27>10,N27<0,N28>10,N28<0),\"Fehler\",IF(ABS(L27)-ABS(M27)-(N27+N28)/2+10>0,IF(L27<0,-(ABS(L27)-ABS(M27)-(N27+N28)/2+10),L27-ABS(M27)-(N27+N28)/2+10),0)),0)","v":0},null,null,null,{"$f":"IF(AND(R27>0,R28>0),IF(OR(R27>10,R27<0,R28>10,R28<0),\"Fehler\",IF(ABS(P27)-ABS(Q27)-(R27+R28)/2+10>0,IF(P27<0,-(ABS(P27)-ABS(Q27)-(R27+R28)/2+10),P27-ABS(Q27)-(R27+R28)/2+10),0)),0)","v":0},null,null,null,{"$f":"IF(AND(V27>0,V28>0),IF(OR(V27>10,V27<0,V28>10,V28<0),\"Fehler\",IF(ABS(T27)-ABS(U27)-(V27+V28)/2+10>0,IF(T27<0,-(ABS(T27)-ABS(U27)-(V27+V28)/2+10),T27-ABS(U27)-(V27+V28)/2+10),0)),0)","v":0},null,null,null,{"$f":"IF(AND(Z27>0,Z28>0),IF(OR(Z27>10,Z27<0,Z28>10,Z28<0),\"Fehler\",IF(ABS(X27)-ABS(Y27)-(Z27+Z28)/2+10>0,IF(X27<0,-(ABS(X27)-ABS(Y27)-(Z27+Z28)/2+10),X27-ABS(Y27)-(Z27+Z28)/2+10),0)),0)","v":0},{"$f":"ABS(G27)+ABS(K27)+ABS(O27)+ABS(S27)+ABS(W27)+ABS(AA27)","v":0}]
[]
[]
[null,null,null,null,null,null,{"$f":"SUM(LARGE(G9:G28,1),LARGE(G9:G28,2),LARGE(G9:G28,3))","v":38.200000000000003},null,null,null,{"$f":"SUM(LARGE(K9:K28,1),LARGE(K9:K28,2),LARGE(K9:K28,3))","v":35.650000000000006},null,null,null,{"$f":"SUM(LARGE(O9:O28,1),LARGE(O9:O28,2),LARGE(O9:O28,3))","v":36.700000000000003},null,null,null,{"$f":"SUM(LARGE(S9:S28,1),LARGE(S9:S28,2),LARGE(S9:S28,3))","v":44.75},null,null,null,{"$f":"SUM(LARGE(W9:W28,1),LARGE(W9:W28,2),LARGE(W9:W28,3))","v":38.549999999999997},null,null,null,{"$f":"SUM(LARGE(AA9:AA28,1),LARGE(AA9:AA28,2),LARGE(AA9:AA28,3))","v":38.200000000000003},{"$f":"SUM(G30,K30,O30,S30,W30,AA30)","v":232.05}]

{"sheet":"Einbeck 1","index":7,"n_rows":30,"n_cols":33,"rows_kept":30,"cut":false,"hidden":false,"merged":[[6,19,6,22],[6,23,6,26],[0,12,0,13],[2,0,2,1],[2,5,2,7],[2,12,2,13],[8,0,9,0],[8,1,9,1],[8,2,9,2],[8,3,9,3],[8,4,9,4],[6,3,6,6],[6,7,6,10],[6,11,6,14],[6,15,6,18],[8,6,9,6],[8,7,9,7],[8,8,9,8],[8,10,9,10],[8,11,9,11],[8,12,9,12],[4,14,4,16],[10,23,11,23],[10,24,11,24],[10,26,11,26],[8,22,9,22],[8,23,9,23],[8,24,9,24],[8,26,9,26],[8,27,9,27],[8,14,9,14],[8,15,9,15],[8,16,9,16],[8,18,9,18],[8,19,9,19],[8,20,9,20],[10,27,11,27],[10,22,11,22],[10,20,11,20],[12,0,13,0],[12,1,13,1],[12,2,13,2],[12,3,13,3],[10,14,11,14],[10,16,11,16],[10,18,11,18],[10,19,11,19],[12,4,13,4],[12,6,13,6],[12,7,13,7],[12,8,13,8],[10,6,11,6],[10,7,11,7],[10,8,11,8],[10,10,11,10],[10,11,11,11],[10,12,11,12],[10,0,11,0],[10,1,11,1],[10,2,11,2],[10,3,11,3],[10,4,11,4],[12,20,13,20],[12,22,13,22],[12,23,13,23],[12,24,13,24],[12,26,13,26],[14,26,15,26],[12,27,13,27],[12,12,13,12],[12,14,13,14],[12,15,13,15],[12,16,13,16],[12,18,13,18],[12,19,13,19],[14,27,15,27],[14,22,15,22],[14,23,15,23],[14,24,15,24],[16,0,17,0],[16,1,17,1],[16,2,17,2],[16,3,17,3],[16,4,17,4],[16,6,17,6],[14,18,15,18],[14,19,15,19],[14,20,15,20],[14,10,15,10],[14,11,15,11],[14,12,15,12],[14,14,15,14],[14,15,15,15],[14,16,15,16],[14,0,15,0],[14,1,15,1],[14,2,15,2],[14,3,15,3],[14,4,15,4],[14,6,15,6],[14,7,15,7],[14,8,15,8],[16,23,17,23],[16,24,17,24],[16,26,17,26],[16,27,17,27],[18,0,19,0],[18,1,19,1],[18,2,19,2],[18,3,19,3],[16,15,17,15],[16,16,17,16],[16,18,17,18],[16,19,17,19],[16,20,17,20],[16,22,17,22],[16,7,17,7],[16,8,17,8],[16,10,17,10],[16,11,17,11],[16,12,17,12],[16,14,17,14],[18,27,19,27],[18,12,19,12],[18,14,19,14],[18,15,19,15],[18,20,19,20],[18,22,19,22],[18,23,19,23],[18,24,19,24],[18,16,19,16],[18,18,19,18],[18,19,19,19],[18,4,19,4],[18,6,19,6],[18,7,19,7],[18,8,19,8],[18,10,19,10],[18,11,19,11],[18,26,19,26],[20,26,21,26],[20,27,21,27],[22,0,23,0],[22,1,23,1],[22,2,23,2],[22,3,23,3],[22,4,23,4],[22,6,23,6],[20,18,21,18],[20,19,21,19],[20,20,21,20],[20,22,21,22],[20,23,21,23],[20,24,21,24],[20,10,21,10],[20,11,21,11],[20,12,21,12],[20,14,21,14],[20,15,21,15],[22,23,23,23],[22,24,23,24],[22,26,23,26],[22,27,23,27],[22,22,23,22],[22,7,23,7],[22,8,23,8],[22,10,23,10],[22,11,23,11],[22,12,23,12],[22,14,23,14],[24,22,25,22],[24,23,25,23],[24,7,25,7],[24,8,25,8],[24,10,25,10],[24,11,25,11],[22,15,23,15],[22,16,23,16],[22,18,23,18],[22,19,23,19],[22,20,23,20],[24,24,25,24],[24,26,25,26],[26,26,27,26],[24,27,25,27],[24,12,25,12],[24,14,25,14],[24,15,25,15],[24,16,25,16],[24,18,25,18],[24,19,25,19],[26,27,27,27],[26,22,27,22],[26,23,27,23],[26,24,27,24],[24,20,25,20],[26,18,27,18],[26,19,27,19],[26,20,27,20],[26,10,27,10],[26,11,27,11],[26,12,27,12],[26,14,27,14],[26,15,27,15],[26,16,27,16],[2,14,2,16],[0,14,0,16],[10,15,11,15],[12,10,13,10],[20,16,21,16],[12,11,13,11],[26,0,27,0],[26,1,27,1],[26,2,27,2],[26,3,27,3],[26,4,27,4],[26,6,27,6],[26,7,27,7],[26,8,27,8],[20,0,21,0],[20,1,21,1],[20,2,21,2],[20,3,21,3],[24,0,25,0],[24,1,25,1],[24,2,25,2],[24,3,25,3],[24,4,25,4],[24,6,25,6],[20,4,21,4],[20,6,21,6],[20,7,21,7],[20,8,21,8]]}
["Wettkampfbogen",null,null,null,null,null,null,null,null,null,null,null,"Datum:",null,{"$f":"'INFO Blatt'!B13","v":"2018-03-03"}]
[]
[null,null,null,null,null,null,null,null,null,null,null,null,"Ort:",null,{"$f":"'INFO Blatt'!B11","v":"Hehlen"}]
[]
[null,null,null,null,null,null,null,null,null,null,null,null,null,"Liga:",{"$f":"'INFO Blatt'!B7","v":"Schülerliga Süd"}]
[]
["Name","Verein","Jg","Boden",null,null,null,"Pferd",null,null,null,"Ringe",null,null,null,"Sprung",null,null,null,"Barren",null,null,null,"Reck",null,null,null,"Ges."]
[null,null,null,"D-Note","Abzug OK","E- Abzug","Note","D-Note","Abzug OK","E- Abzug","Note","D-Note","Abzug OK","E-Abzug","Note","D-Note","Abzug OK","E-Abzug","Note","D-Note","Abzug OK","E-Abzug","Note","D-Note","Abzug OK","E-Abzug","Note"]
["Tom Leonhard",{"$f":"Formeln!A9","v":"Einbecker SV 1"},{"$f":"IF(A9<>\"\", VLOOKUP(A9,'Wertungszettel M5'!A$7:B$36,2,0),\"\")","v":"07"},7,null,3.2,{"$f":"IF(AND(F9>0,F10>0),IF(OR(F9>10,F9<0,F10>10,F10<0),\"Fehler\",IF(ABS(D9)-ABS(E9)-(F9+F10)/2+10>0,IF(D9<0,-(ABS(D9)-ABS(E9)-(F9+F10)/2+10),D9-ABS(E9)-(F9+F10)/2+10),0)),0)","v":13.9},6,null,4,{"$f":"IF(AND(J9>0,J10>0),IF(OR(J9>10,J9<0,J10>10,J10<0),\"Fehler\",IF(ABS(H9)-ABS(I9)-(J9+J10)/2+10>0,IF(H9<0,-(ABS(H9)-ABS(I9)-(J9+J10)/2+10),H9-ABS(I9)-(J9+J10)/2+10),0)),0)","v":11.9},6,0.5,2.6,{"$f":"IF(AND(N9>0,N10>0),IF(OR(N9>10,N9<0,N10>10,N10<0),\"Fehler\",IF(ABS(L9)-ABS(M9)-(N9+N10)/2+10>0,IF(L9<0,-(ABS(L9)-ABS(M9)-(N9+N10)/2+10),L9-ABS(M9)-(N9+N10)/2+10),0)),0)","v":12.8},6,null,2,{"$f":"IF(AND(R9>0,R10>0),IF(OR(R9>10,R9<0,R10>10,R10<0),\"Fehler\",IF(ABS(P9)-ABS(Q9)-(R9+R10)/2+10>0,IF(P9<0,-(ABS(P9)-ABS(Q9)-(R9+R10)/2+10),P9-ABS(Q9)-(R9+R10)/2+10),0)),0)","v":14},5,null,2,{"$f":"IF(AND(V9>0,V10>0),IF(OR(V9>10,V9<0,V10>10,V10<0),\"Fehler\",IF(ABS(T9)-ABS(U9)-(V9+V10)/2+10>0,IF(T9<0,-(ABS(T9)-ABS(U9)-(V9+V10)/2+10),T9-ABS(U9)-(V9+V10)/2+10),0)),0)","v":13},5,null,1.8,{"$f":"IF(AND(Z9>0,Z10>0),IF(OR(Z9>10,Z9<0,Z10>10,Z10<0),\"Fehler\",IF(ABS(X9)-ABS(Y9)-(Z9+Z10)/2+10>0,IF(X9<0,-(ABS(X9)-ABS(Y9)-(Z9+Z10)/2+10),X9-ABS(Y9)-(Z9+Z10)/2+10),0)),0)","v":13.15},{"$f":"ABS(G9)+ABS(K9)+ABS(O9)+ABS(S9)+ABS(W9)+ABS(AA9)","v":78.75}]
[null,null,null,null,null,3,null,null,null,4.2,null,null,null,2.8,null,null,null,2,null,null,null,2,null,null,null,1.9]
["Eugen Dahl",{"$f":"IF(A11>0,B9,\"\")","v":"Einbecker SV 1"},{"$f":"IF(A11<>\"\", VLOOKUP(A11,'Wertungszettel M5'!A$7:B$36,2,0),\"\")","v":"05"},null,null,null,{"$f":"IF(AND(F11>0,F12>0),IF(OR(F11>10,F11<0,F12>10,F12<0),\"Fehler\",IF(ABS(D11)-ABS(E11)-(F11+F12)/2+10>0,IF(D11<0,-(ABS(D11)-ABS(E11)-(F11+F12)/2+10),D11-ABS(E11)-(F11+F12)/2+10),0)),0)","v":0},null,null,null,{"$f":"IF(AND(J11>0,J12>0),IF(OR(J11>10,J11<0,J12>10,J12<0),\"Fehler\",IF(ABS(H11)-ABS(I11)-(J11+J12)/2+10>0,IF(H11<0,-(ABS(H11)-ABS(I11)-(J11+J12)/2+10),H11-ABS(I11)-(J11+J12)/2+10),0)),0)","v":0},null,null,null,{"$f":"IF(AND(N11>0,N12>0),IF(OR(N11>10,N11<0,N12>10,N12<0),\"Fehler\",IF(ABS(L11)-ABS(M11)-(N11+N12)/2+10>0,IF(L11<0,-(ABS(L11)-ABS(M11)-(N11+N12)/2+10),L11-ABS(M11)-(N11+N12)/2+10),0)),0)","v":0},null,null,null,{"$f":"IF(AND(R11>0,R12>0),IF(OR(R11>10,R11<0,R12>10,R12<0),\"Fehler\",IF(ABS(P11)-ABS(Q11)-(R11+R12)/2+10>0,IF(P11<0,-(ABS(P11)-ABS(Q11)-(R11+R12)/2+10),P11-ABS(Q11)-(R11+R12)/2+10),0)),0)","v":0},null,null,null,{"$f":"IF(AND(V11>0,V12>0),IF(OR(V11>10,V11<0,V12>10,V12<0),\"Fehler\",IF(ABS(T11)-ABS(U11)-(V11+V12)/2+10>0,IF(T11<0,-(ABS(T11)-ABS(U11)-(V11+V12)/2+10),T11-ABS(U11)-(V11+V12)/2+10),0)),0)","v":0},null,null,null,{"$f":"IF(AND(Z11>0,Z12>0),IF(OR(Z11>10,Z11<0,Z12>10,Z12<0),\"Fehler\",IF(ABS(X11)-ABS(Y11)-(Z11+Z12)/2+10>0,IF(X11<0,-(ABS(X11)-ABS(Y11)-(Z11+Z12)/2+10),X11-ABS(Y11)-(Z11+Z12)/2+10),0)),0)","v":0},{"$f":"ABS(G11)+ABS(K11)+ABS(O11)+ABS(S11)+ABS(W11)+ABS(AA11)","v":0},null,null,null,"Boden",{"$f":"IF(G30>1,1,0)","v":1}]
[null,null,null,null,null,null,null,null,null,null,null,null,null,null,null,null,null,null,null,null,null,null,null,null,null,null,null,null,null,null,null,"pauschenpferd",{"$f":"IF(K30>1,1,0)","v":1}]
["Dominic Kobben",{"$f":"IF(A13>0,B11,\"\")","v":"Einbecker SV 1"},{"$f":"IF(A13<>\"\", VLOOKUP(A13,'Wertungszettel M5'!A$7:B$36,2,0),\"\")","v":"05"},null,null,null,{"$f":"IF(AND(F13>0,F14>0),IF(OR(F13>10,F13<0,F14>10,F14<0),\"Fehler\",IF(ABS(D13)-ABS(E13)-(F13+F14)/2+10>0,IF(D13<0,-(ABS(D13)-ABS(E13)-(F13+F14)/2+10),D13-ABS(E13)-(F13+F14)/2+10),0)),0)","v":0},null,null,null,{"$f":"IF(AND(J13>0,J14>0),IF(OR(J13>10,J13<0,J14>10,J14<0),\"Fehler\",IF(ABS(H13)-ABS(I13)-(J13+J14)/2+10>0,IF(H13<0,-(ABS(H13)-ABS(I13)-(J13+J14)/2+10),H13-ABS(I13)-(J13+J14)/2+10),0)),0)","v":0},null,null,null,{"$f":"IF(AND(N13>0,N14>0),IF(OR(N13>10,N13<0,N14>10,N14<0),\"Fehler\",IF(ABS(L13)-ABS(M13)-(N13+N14)/2+10>0,IF(L13<0,-(ABS(L13)-ABS(M13)-(N13+N14)/2+10),L13-ABS(M13)-(N13+N14)/2+10),0)),0)","v":0},null,null,null,{"$f":"IF(AND(R13>0,R14>0),IF(OR(R13>10,R13<0,R14>10,R14<0),\"Fehler\",IF(ABS(P13)-ABS(Q13)-(R13+R14)/2+10>0,IF(P13<0,-(ABS(P13)-ABS(Q13)-(R13+R14)/2+10),P13-ABS(Q13)-(R13+R14)/2+10),0)),0)","v":0},null,null,null,{"$f":"IF(AND(V13>0,V14>0),IF(OR(V13>10,V13<0,V14>10,V14<0),\"Fehler\",IF(ABS(T13)-ABS(U13)-(V13+V14)/2+10>0,IF(T13<0,-(ABS(T13)-ABS(U13)-(V13+V14)/2+10),T13-ABS(U13)-(V13+V14)/2+10),0)),0)","v":0},null,null,null,{"$f":"IF(AND(Z13>0,Z14>0),IF(OR(Z13>10,Z13<0,Z14>10,Z14<0),\"Fehler\",IF(ABS(X13)-ABS(Y13)-(Z13+Z14)/2+10>0,IF(X13<0,-(ABS(X13)-ABS(Y13)-(Z13+Z14)/2+10),X13-ABS(Y13)-(Z13+Z14)/2+10),0)),0)","v":0},{"$f":"ABS(G13)+ABS(K13)+ABS(O13)+ABS(S13)+ABS(W13)+ABS(AA13)","v":0},null,null,null,"ringe",{"$f":"IF(O30>1,1,0)","v":1}]
[null,null,null,null,null,null,null,null,null,null,null,null,null,null,null,null,null,null,null,null,null,null,null,null,null,null,null,null,null,null,null,"sprung",{"$f":"IF(S30>1,1,0)","v":1}]
["Illes Törjek",{"$f":"IF(A15>0,B13,\"\")","v":"Einbecker SV 1"},{"$f":"IF(A15<>\"\", VLOOKUP(A15,'Wertungszettel M5'!A$7:B$36,2,0),\"\")","v":"06"},null,null,null,{"$f":"IF(AND(F15>0,F16>0),IF(OR(F15>10,F15<0,F16>10,F16<0),\"Fehler\",IF(ABS(D15)-ABS(E15)-(F15+F16)/2+10>0,IF(D15<0,-(ABS(D15)-ABS(E15)-(F15+F16)/2+10),D15-ABS(E15)-(F15+F16)/2+10),0)),0)","v":0},null,null,null,{"$f":"IF(AND(J15>0,J16>0),IF(OR(J15>10,J15<0,J16>10,J16<0),\"Fehler\",IF(ABS(H15)-ABS(I15)-(J15+J16)/2+10>0,IF(H15<0,-(ABS(H15)-ABS(I15)-(J15+J16)/2+10),H15-ABS(I15)-(J15+J16)/2+10),0)),0)","v":0},null,null,null,{"$f":"IF(AND(N15>0,N16>0),IF(OR(N15>10,N15<0,N16>10,N16<0),\"Fehler\",IF(ABS(L15)-ABS(M15)-(N15+N16)/2+10>0,IF(L15<0,-(ABS(L15)-ABS(M15)-(N15+N16)/2+10),L15-ABS(M15)-(N15+N16)/2+10),0)),0)","v":0},null,null,null,{"$f":"IF(AND(R15>0,R16>0),IF(OR(R15>10,R15<0,R16>10,R16<0),\"Fehler\",IF(ABS(P15)-ABS(Q15)-(R15+R16)/2+10>0,IF(P15<0,-(ABS(P15)-ABS(Q15)-(R15+R16)/2+10),P15-ABS(Q15)-(R15+R16)/2+10),0)),0)","v":0},null,null,null,{"$f":"IF(AND(V15>0,V16>0),IF(OR(V15>10,V15<0,V16>10,V16<0),\"Fehler\",IF(ABS(T15)-ABS(U15)-(V15+V16)/2+10>0,IF(T15<0,-(ABS(T15)-ABS(U15)-(V15+V16)/2+10),T15-ABS(U15)-(V15+V16)/2+10),0)),0)","v":0},null,null,null,{"$f":"IF(AND(Z15>0,Z16>0),IF(OR(Z15>10,Z15<0,Z16>10,Z16<0),\"Fehler\",IF(ABS(X15)-ABS(Y15)-(Z15+Z16)/2+10>0,IF(X15<0,-(ABS(X15)-ABS(Y15)-(Z15+Z16)/2+10),X15-ABS(Y15)-(Z15+Z16)/2+10),0)),0)","v":0},{"$f":"ABS(G15)+ABS(K15)+ABS(O15)+ABS(S15)+ABS(W15)+ABS(AA15)","v":0},null,null,null,"Barren",{"$f":"IF(W30>1,1,0)","v":1}]
[null,null,null,null,null,null,null,null,null,null,null,null,null,null,null,null,null,null,null,null,null,null,null,null,null,null,null,null,null,null,null,"Reck",{"$f":"IF(AA30>1,1,0)","v":1}]
["Marlon Sassin",{"$f":"IF(A17>0,B15,\"\")","v":"Einbecker SV 1"},{"$f":"IF(A17<>\"\", VLOOKUP(A17,'Wertungszettel M5'!A$7:B$36,2,0),\"\")","v":"09"},6,null,2.9,{"$f":"IF(AND(F17>0,F18>0),IF(OR(F17>10,F17<0,F18>10,F18<0),\"Fehler\",IF(ABS(D17)-ABS(E17)-(F17+F18)/2+10>0,IF(D17<0,-(ABS(D17)-ABS(E17)-(F17+F18)/2+10),D17-ABS(E17)-(F17+F18)/2+10),0)),0)","v":13},5,1.3,4.5,{"$f":"IF(AND(J17>0,J18>0),IF(OR(J17>10,J17<0,J18>10,J18<0),\"Fehler\",IF(ABS(H17)-ABS(I17)-(J17+J18)/2+10>0,IF(H17<0,-(ABS(H17)-ABS(I17)-(J17+J18)/2+10),H17-ABS(I17)-(J17+J18)/2+10),0)),0)","v":8.8500000000000014},5,1.5,2.7,{"$f":"IF(AND(N17>0,N18>0),IF(OR(N17>10,N17<0,N18>10,N18<0),\"Fehler\",IF(ABS(L17)-ABS(M17)-(N17+N18)/2+10>0,IF(L17<0,-(ABS(L17)-ABS(M17)-(N17+N18)/2+10),L17-ABS(M17)-(N17+N18)/2+10),0)),0)","v":10.7},5,null,1.4,{"$f":"IF(AND(R17>0,R18>0),IF(OR(R17>10,R17<0,R18>10,R18<0),\"Fehler\",IF(ABS(P17)-ABS(Q17)-(R17+R18)/2+10>0,IF(P17<0,-(ABS(P17)-ABS(Q17)-(R17+R18)/2+10),P17-ABS(Q17)-(R17+R18)/2+10),0)),0)","v":13.5},5,null,3.4,{"$f":"IF(AND(V17>0,V18>0),IF(OR(V17>10,V17<0,V18>10,V18<0),\"Fehler\",IF(ABS(T17)-ABS(U17)-(V17+V18)/2+10>0,IF(T17<0,-(ABS(T17)-ABS(U17)-(V17+V18)/2+10),T17-ABS(U17)-(V17+V18)/2+10),0)),0)","v":11.7},5,null,3.7,{"$f":"IF(AND(Z17>0,Z18>0),IF(OR(Z17>10,Z17<0,Z18>10,Z18<0),\"Fehler\",IF(ABS(X17)-ABS(Y17)-(Z17+Z18)/2+10>0,IF(X17<0,-(ABS(X17)-ABS(Y17)-(Z17+Z18)/2+10),X17-ABS(Y17)-(Z17+Z18)/2+10),0)),0)","v":11.05},{"$f":"ABS(G17)+ABS(K17)+ABS(O17)+ABS(S17)+ABS(W17)+ABS(AA17)","v":68.8}]
[null,null,null,null,null,3.1,null,null,null,5.2,null,null,null,2.9,null,null,null,1.6,null,null,null,3.2,null,null,null,4.2,null,null,null,null,null,"Gesamt",{"$f":"SUM(AG11:AG17)","v":6}]
["Nicolas Buchholz",{"$f":"IF(A19>0,B17,\"\")","v":"Einbecker SV 1"},{"$f":"IF(A19<>\"\", VLOOKUP(A19,'Wertungszettel M5'!A$7:B$36,2,0),\"\")","v":"05"},null,null,null,{"$f":"IF(AND(F19>0,F20>0),IF(OR(F19>10,F19<0,F20>10,F20<0),\"Fehler\",IF(ABS(D19)-ABS(E19)-(F19+F20)/2+10>0,IF(D19<0,-(ABS(D19)-ABS(E19)-(F19+F20)/2+10),D19-ABS(E19)-(F19+F20)/2+10),0)),0)","v":0},null,null,null,{"$f":"IF(AND(J19>0,J20>0),IF(OR(J19>10,J19<0,J20>10,J20<0),\"Fehler\",IF(ABS(H19)-ABS(I19)-(J19+J20)/2+10>0,IF(H19<0,-(ABS(H19)-ABS(I19)-(J19+J20)/2+10),H19-ABS(I19)-(J19+J20)/2+10),0)),0)","v":0},null,null,null,{"$f":"IF(AND(N19>0,N20>0),IF(OR(N19>10,N19<0,N20>10,N20<0),\"Fehler\",IF(ABS(L19)-ABS(M19)-(N19+N20)/2+10>0,IF(L19<0,-(ABS(L19)-ABS(M19)-(N19+N20)/2+10),L19-ABS(M19)-(N19+N20)/2+10),0)),0)","v":0},null,null,null,{"$f":"IF(AND(R19>0,R20>0),IF(OR(R19>10,R19<0,R20>10,R20<0),\"Fehler\",IF(ABS(P19)-ABS(Q19)-(R19+R20)/2+10>0,IF(P19<0,-(ABS(P19)-ABS(Q19)-(R19+R20)/2+10),P19-ABS(Q19)-(R19+R20)/2+10),0)),0)","v":0},null,null,null,{"$f":"IF(AND(V19>0,V20>0),IF(OR(V19>10,V19<0,V20>10,V20<0),\"Fehler\",IF(ABS(T19)-ABS(U19)-(V19+V20)/2+10>0,IF(T19<0,-(ABS(T19)-ABS(U19)-(V19+V20)/2+10),T19-ABS(U19)-(V19+V20)/2+10),0)),0)","v":0},null,null,null,{"$f":"IF(AND(Z19>0,Z20>0),IF(OR(Z19>10,Z19<0,Z20>10,Z20<0),\"Fehler\",IF(ABS(X19)-ABS(Y19)-(Z19+Z20)/2+10>0,IF(X19<0,-(ABS(X19)-ABS(Y19)-(Z19+Z20)/2+10),X19-ABS(Y19)-(Z19+Z20)/2+10),0)),0)","v":0},{"$f":"ABS(G19)+ABS(K19)+ABS(O19)+ABS(S19)+ABS(W19)+ABS(AA19)","v":0}]
[]
["Dins Kozlovskis",{"$f":"IF(A21>0,B19,\"\")","v":"Einbecker SV 1"},{"$f":"IF(A21<>\"\", VLOOKUP(A21,'Wertungszettel M5'!A$7:B$36,2,0),\"\")","v":"06"},null,null,null,{"$f":"IF(AND(F21>0,F22>0),IF(OR(F21>10,F21<0,F22>10,F22<0),\"Fehler\",IF(ABS(D21)-ABS(E21)-(F21+F22)/2+10>0,IF(D21<0,-(ABS(D21)-ABS(E21)-(F21+F22)/2+10),D21-ABS(E21)-(F21+F22)/2+10),0)),0)","v":0},null,null,null,{"$f":"IF(AND(J21>0,J22>0),IF(OR(J21>10,J21<0,J22>10,J22<0),\"Fehler\",IF(ABS(H21)-ABS(I21)-(J21+J22)/2+10>0,IF(H21<0,-(ABS(H21)-ABS(I21)-(J21+J22)/2+10),H21-ABS(I21)-(J21+J22)/2+10),0)),0)","v":0},null,null,null,{"$f":"IF(AND(N21>0,N22>0),IF(OR(N21>10,N21<0,N22>10,N22<0),\"Fehler\",IF(ABS(L21)-ABS(M21)-(N21+N22)/2+10>0,IF(L21<0,-(ABS(L21)-ABS(M21)-(N21+N22)/2+10),L21-ABS(M21)-(N21+N22)/2+10),0)),0)","v":0},null,null,null,{"$f":"IF(AND(R21>0,R22>0),IF(OR(R21>10,R21<0,R22>10,R22<0),\"Fehler\",IF(ABS(P21)-ABS(Q21)-(R21+R22)/2+10>0,IF(P21<0,-(ABS(P21)-ABS(Q21)-(R21+R22)/2+10),P21-ABS(Q21)-(R21+R22)/2+10),0)),0)","v":0},null,null,null,{"$f":"IF(AND(V21>0,V22>0),IF(OR(V21>10,V21<0,V22>10,V22<0),\"Fehler\",IF(ABS(T21)-ABS(U21)-(V21+V22)/2+10>0,IF(T21<0,-(ABS(T21)-ABS(U21)-(V21+V22)/2+10),T21-ABS(U21)-(V21+V22)/2+10),0)),0)","v":0},null,null,null,{"$f":"IF(AND(Z21>0,Z22>0),IF(OR(Z21>10,Z21<0,Z22>10,Z22<0),\"Fehler\",IF(ABS(X21)-ABS(Y21)-(Z21+Z22)/2+10>0,IF(X21<0,-(ABS(X21)-ABS(Y21)-(Z21+Z22)/2+10),X21-ABS(Y21)-(Z21+Z22)/2+10),0)),0)","v":0},{"$f":"ABS(G21)+ABS(K21)+ABS(O21)+ABS(S21)+ABS(W21)+ABS(AA21)","v":0}]
[]
["Fiete Linneweber",{"$f":"IF(A23>0,B21,\"\")","v":"Einbecker SV 1"},{"$f":"IF(A23<>\"\", VLOOKUP(A23,'Wertungszettel M5'!A$7:B$36,2,0),\"\")","v":"07"},5,null,3,{"$f":"IF(AND(F23>0,F24>0),IF(OR(F23>10,F23<0,F24>10,F24<0),\"Fehler\",IF(ABS(D23)-ABS(E23)-(F23+F24)/2+10>0,IF(D23<0,-(ABS(D23)-ABS(E23)-(F23+F24)/2+10),D23-ABS(E23)-(F23+F24)/2+10),0)),0)","v":12},5,null,5.2,{"$f":"IF(AND(J23>0,J24>0),IF(OR(J23>10,J23<0,J24>10,J24<0),\"Fehler\",IF(ABS(H23)-ABS(I23)-(J23+J24)/2+10>0,IF(H23<0,-(ABS(H23)-ABS(I23)-(J23+J24)/2+10),H23-ABS(I23)-(J23+J24)/2+10),0)),0)","v":9.5500000000000007},null,null,null,{"$f":"IF(AND(N23>0,N24>0),IF(OR(N23>10,N23<0,N24>10,N24<0),\"Fehler\",IF(ABS(L23)-ABS(M23)-(N23+N24)/2+10>0,IF(L23<0,-(ABS(L23)-ABS(M23)-(N23+N24)/2+10),L23-ABS(M23)-(N23+N24)/2+10),0)),0)","v":0},5,null,1.2,{"$f":"IF(AND(R23>0,R24>0),IF(OR(R23>10,R23<0,R24>10,R24<0),\"Fehler\",IF(ABS(P23)-ABS(Q23)-(R23+R24)/2+10>0,IF(P23<0,-(ABS(P23)-ABS(Q23)-(R23+R24)/2+10),P23-ABS(Q23)-(R23+R24)/2+10),0)),0)","v":13.8},4,1,4.0999999999999996,{"$f":"IF(AND(V23>0,V24>0),IF(OR(V23>10,V23<0,V24>10,V24<0),\"Fehler\",IF(ABS(T23)-ABS(U23)-(V23+V24)/2+10>0,IF(T23<0,-(ABS(T23)-ABS(U23)-(V23+V24)/2+10),T23-ABS(U23)-(V23+V24)/2+10),0)),0)","v":8.9499999999999993},4,null,2.6,{"$f":"IF(AND(Z23>0,Z24>0),IF(OR(Z23>10,Z23<0,Z24>10,Z24<0),\"Fehler\",IF(ABS(X23)-ABS(Y23)-(Z23+Z24)/2+10>0,IF(X23<0,-(ABS(X23)-ABS(Y23)-(Z23+Z24)/2+10),X23-ABS(Y23)-(Z23+Z24)/2+10),0)),0)","v":11.3},{"$f":"ABS(G23)+ABS(K23)+ABS(O23)+ABS(S23)+ABS(W23)+ABS(AA23)","v":55.599999999999994}]
[null,null,null,null,null,3,null,null,null,5.7,null,null,null,null,null,null,null,1.2,null,null,null,4,null,null,null,2.8]
["Joel Eitemeier",{"$f":"IF(A25>0,B23,\"\")","v":"Einbecker SV 1"},{"$f":"IF(A25<>\"\", VLOOKUP(A25,'Wertungszettel M5'!A$7:B$36,2,0),\"\")","v":"06"},4,1.5,2.4,{"$f":"IF(AND(F25>0,F26>0),IF(OR(F25>10,F25<0,F26>10,F26<0),\"Fehler\",IF(ABS(D25)-ABS(E25)-(F25+F26)/2+10>0,IF(D25<0,-(ABS(D25)-ABS(E25)-(F25+F26)/2+10),D25-ABS(E25)-(F25+F26)/2+10),0)),0)","v":10.1},null,null,null,{"$f":"IF(AND(J25>0,J26>0),IF(OR(J25>10,J25<0,J26>10,J26<0),\"Fehler\",IF(ABS(H25)-ABS(I25)-(J25+J26)/2+10>0,IF(H25<0,-(ABS(H25)-ABS(I25)-(J25+J26)/2+10),H25-ABS(I25)-(J25+J26)/2+10),0)),0)","v":0},4,0.5,3.1,{"$f":"IF(AND(N25>0,N26>0),IF(OR(N25>10,N25<0,N26>10,N26<0),\"Fehler\",IF(ABS(L25)-ABS(M25)-(N25+N26)/2+10>0,IF(L25<0,-(ABS(L25)-ABS(M25)-(N25+N26)/2+10),L25-ABS(M25)-(N25+N26)/2+10),0)),0)","v":10.4},5,null,1.4,{"$f":"IF(AND(R25>0,R26>0),IF(OR(R25>10,R25<0,R26>10,R26<0),\"Fehler\",IF(ABS(P25)-ABS(Q25)-(R25+R26)/2+10>0,IF(P25<0,-(ABS(P25)-ABS(Q25)-(R25+R26)/2+10),P25-ABS(Q25)-(R25+R26)/2+10),0)),0)","v":13.5},4,null,2.2000000000000002,{"$f":"IF(AND(V25>0,V26>0),IF(OR(V25>10,V25<0,V26>10,V26<0),\"Fehler\",IF(ABS(T25)-ABS(U25)-(V25+V26)/2+10>0,IF(T25<0,-(ABS(T25)-ABS(U25)-(V25+V26)/2+10),T25-ABS(U25)-(V25+V26)/2+10),0)),0)","v":11.6},4,null,2.8,{"$f":"IF(AND(Z25>0,Z26>0),IF(OR(Z25>10,Z25<0,Z26>10,Z26<0),\"Fehler\",IF(ABS(X25)-ABS(Y25)-(Z25+Z26)/2+10>0,IF(X25<0,-(ABS(X25)-ABS(Y25)-(Z25+Z26)/2+10),X25-ABS(Y25)-(Z25+Z26)/2+10),0)),0)","v":11.15},{"$f":"ABS(G25)+ABS(K25)+ABS(O25)+ABS(S25)+ABS(W25)+ABS(AA25)","v":56.75}]
[null,null,null,null,null,2.4,null,null,null,null,null,null,null,3.1,null,null,null,1.6,null,null,null,2.6,null,null,null,2.9]
[null,{"$f":"IF(A27>0,B25,\"\")","v":""},{"$f":"IF(A27<>\"\", VLOOKUP(A27,'Wertungszettel M5'!A$7:B$36,2,0),\"\")","v":""},null,null,null,{"$f":"IF(AND(F27>0,F28>0),IF(OR(F27>10,F27<0,F28>10,F28<0),\"Fehler\",IF(ABS(D27)-ABS(E27)-(F27+F28)/2+10>0,IF(D27<0,-(ABS(D27)-ABS(E27)-(F27+F28)/2+10),D27-ABS(E27)-(F27+F28)/2+10),0)),0)","v":0},null,null,null,{"$f":"IF(AND(J27>0,J28>0),IF(OR(J27>10,J27<0,J28>10,J28<0),\"Fehler\",IF(ABS(H27)-ABS(I27)-(J27+J28)/2+10>0,IF(H27<0,-(ABS(H27)-ABS(I27)-(J27+J28)/2+10),H27-ABS(I27)-(J27+J28)/2+10),0)),0)","v":0},null,null,null,{"$f":"IF(AND(N27>0,N28>0),IF(OR(N27>10,N27<0,N28>10,N28<0),\"Fehler\",IF(ABS(L27)-ABS(M27)-(N27+N28)/2+10>0,IF(L27<0,-(ABS(L27)-ABS(M27)-(N27+N28)/2+10),L27-ABS(M27)-(N27+N28)/2+10),0)),0)","v":0},null,null,null,{"$f":"IF(AND(R27>0,R28>0),IF(OR(R27>10,R27<0,R28>10,R28<0),\"Fehler\",IF(ABS(P27)-ABS(Q27)-(R27+R28)/2+10>0,IF(P27<0,-(ABS(P27)-ABS(Q27)-(R27+R28)/2+10),P27-ABS(Q27)-(R27+R28)/2+10),0)),0)","v":0},null,null,null,{"$f":"IF(AND(V27>0,V28>0),IF(OR(V27>10,V27<0,V28>10,V28<0),\"Fehler\",IF(ABS(T27)-ABS(U27)-(V27+V28)/2+10>0,IF(T27<0,-(ABS(T27)-ABS(U27)-(V27+V28)/2+10),T27-ABS(U27)-(V27+V28)/2+10),0)),0)","v":0},null,null,null,{"$f":"IF(AND(Z27>0,Z28>0),IF(OR(Z27>10,Z27<0,Z28>10,Z28<0),\"Fehler\",IF(ABS(X27)-ABS(Y27)-(Z27+Z28)/2+10>0,IF(X27<0,-(ABS(X27)-ABS(Y27)-(Z27+Z28)/2+10),X27-ABS(Y27)-(Z27+Z28)/2+10),0)),0)","v":0},{"$f":"ABS(G27)+ABS(K27)+ABS(O27)+ABS(S27)+ABS(W27)+ABS(AA27)","v":0}]
[]
[]
[null,null,null,null,null,null,{"$f":"SUM(LARGE(G9:G28,1),LARGE(G9:G28,2),LARGE(G9:G28,3))","v":38.9},null,null,null,{"$f":"SUM(LARGE(K9:K28,1),LARGE(K9:K28,2),LARGE(K9:K28,3))","v":30.300000000000004},null,null,null,{"$f":"SUM(LARGE(O9:O28,1),LARGE(O9:O28,2),LARGE(O9:O28,3))","v":33.9},null,null,null,{"$f":"SUM(LARGE(S9:S28,1),LARGE(S9:S28,2),LARGE(S9:S28,3))","v":41.3},null,null,null,{"$f":"SUM(LARGE(W9:W28,1),LARGE(W9:W28,2),LARGE(W9:W28,3))","v":36.299999999999997},null,null,null,{"$f":"SUM(LARGE(AA9:AA28,1),LARGE(AA9:AA28,2),LARGE(AA9:AA28,3))","v":35.6},{"$f":"SUM(G30,K30,O30,S30,W30,AA30)","v":216.29999999999998}]

{"sheet":"Boffzen","index":8,"n_rows":30,"n_cols":33,"rows_kept":30,"cut":false,"hidden":false,"merged":[[6,19,6,22],[6,23,6,26],[0,12,0,13],[2,0,2,1],[2,5,2,7],[2,12,2,13],[8,0,9,0],[8,1,9,1],[8,2,9,2],[8,3,9,3],[8,4,9,4],[6,3,6,6],[6,7,6,10],[6,11,6,14],[6,15,6,18],[8,6,9,6],[8,7,9,7],[8,8,9,8],[8,10,9,10],[8,11,9,11],[8,12,9,12],[10,23,11,23],[10,24,11,24],[10,26,11,26],[8,22,9,22],[8,23,9,23],[8,24,9,24],[8,26,9,26],[8,27,9,27],[8,14,9,14],[8,15,9,15],[8,16,9,16],[8,18,9,18],[8,19,9,19],[8,20,9,20],[10,27,11,27],[10,22,11,22],[10,19,11,19],[10,20,11,20],[12,0,13,0],[12,1,13,1],[12,2,13,2],[12,3,13,3],[10,14,11,14],[10,16,11,16],[10,18,11,18],[12,4,13,4],[12,6,13,6],[12,7,13,7],[12,8,13,8],[10,6,11,6],[10,7,11,7],[10,8,11,8],[10,10,11,10],[10,11,11,11],[10,12,11,12],[10,0,11,0],[10,1,11,1],[10,2,11,2],[10,3,11,3],[10,4,11,4],[12,20,13,20],[12,22,13,22],[12,23,13,23],[12,24,13,24],[12,26,13,26],[14,26,15,26],[12,27,13,27],[12,12,13,12],[12,14,13,14],[12,15,13,15],[12,16,13,16],[12,18,13,18],[12,19,13,19],[14,27,15,27],[14,22,15,22],[14,23,15,23],[14,24,15,24],[16,0,17,0],[16,1,17,1],[16,2,17,2],[16,3,17,3],[16,4,17,4],[16,6,17,6],[14,18,15,18],[14,19,15,19],[14,20,15,20],[14,10,15,10],[14,11,15,11],[14,12,15,12],[14,14,15,14],[14,15,15,15],[14,16,15,16],[14,0,15,0],[14,1,15,1],[14,2,15,2],[14,3,15,3],[14,4,15,4],[14,6,15,6],[14,7,15,7],[14,8,15,8],[16,23,17,23],[16,24,17,24],[16,26,17,26],[16,27,17,27],[18,0,19,0],[18,1,19,1],[18,2,19,2],[18,3,19,3],[16,15,17,15],[16,16,17,16],[16,18,17,18],[16,19,17,19],[16,20,17,20],[16,22,17,22],[16,7,17,7],[16,8,17,8],[16,10,17,10],[16,11,17,11],[16,12,17,12],[16,14,17,14],[18,27,19,27],[18,12,19,12],[18,14,19,14],[18,15,19,15],[18,20,19,20],[18,22,19,22],[18,23,19,23],[18,24,19,24],[18,16,19,16],[18,18,19,18],[18,19,19,19],[18,4,19,4],[18,6,19,6],[18,7,19,7],[18,8,19,8],[18,10,19,10],[18,11,19,11],[18,26,19,26],[20,26,21,26],[20,27,21,27],[22,0,23,0],[22,1,23,1],[22,2,23,2],[22,3,23,3],[22,4,23,4],[22,6,23,6],[20,18,21,18],[20,19,21,19],[20,20,21,20],[20,22,21,22],[20,23,21,23],[20,24,21,24],[20,10,21,10],[20,11,21,11],[20,12,21,12],[20,14,21,14],[20,15,21,15],[22,23,23,23],[22,24,23,24],[22,26,23,26],[22,27,23,27],[22,22,23,22],[22,7,23,7],[22,8,23,8],[22,10,23,10],[22,11,23,11],[22,12,23,12],[22,14,23,14],[24,22,25,22],[24,23,25,23],[24,7,25,7],[24,8,25,8],[24,10,25,10],[24,11,25,11],[22,15,23,15],[22,16,23,16],[22,18,23,18],[22,19,23,19],[22,20,23,20],[24,24,25,24],[24,26,25,26],[26,26,27,26],[24,27,25,27],[24,12,25,12],[24,14,25,14],[24,15,25,15],[24,16,25,16],[24,18,25,18],[24,19,25,19],[26,27,27,27],[26,22,27,22],[26,23,27,23],[26,24,27,24],[24,20,25,20],[26,18,27,18],[26,19,27,19],[26,20,27,20],[26,10,27,10],[26,11,27,11],[26,12,27,12],[26,14,27,14],[26,15,27,15],[26,16,27,16],[0,14,0,16],[2,14,2,16],[4,14,4,16],[10,15,11,15],[20,16,21,16],[12,10,13,10],[12,11,13,11],[26,0,27,0],[26,1,27,1],[26,2,27,2],[26,3,27,3],[26,4,27,4],[26,6,27,6],[26,7,27,7],[26,8,27,8],[20,0,21,0],[20,1,21,1],[20,2,21,2],[20,3,21,3],[24,0,25,0],[24,1,25,1],[24,2,25,2],[24,3,25,3],[24,4,25,4],[24,6,25,6],[20,4,21,4],[20,6,21,6],[20,7,21,7],[20,8,21,8]]}
["Wettkampfbogen",null,null,null,null,null,null,null,null,null,null,null,"Datum:",null,{"$f":"'INFO Blatt'!B13","v":"2018-03-03"}]
[]
[null,null,null,null,null,null,null,null,null,{"$f":"K4","v":0},null,null,"Ort:",null,{"$f":"'INFO Blatt'!B11","v":"Hehlen"}]
[]
[null,null,null,null,null,null,null,null,null,null,null,null,null,"Liga:",{"$f":"'INFO Blatt'!B7","v":"Schülerliga Süd"}]
[]
["Name","Verein","Jg","Boden",null,null,null,"Pferd",null,null,null,"Ringe",null,null,null,"Sprung",null,null,null,"Barren",null,null,null,"Reck",null,null,null,"Ges."]
[null,null,null,"D-Note","Abzug OK","E- Abzug","Note","D-Note","Abzug OK","E- Abzug","Note","D-Note","Abzug OK","E-Abzug","Note","D-Note","Abzug OK","E-Abzug","Note","D-Note","Abzug OK","E-Abzug","Note","D-Note","Abzug OK","E-Abzug","Note"]
["Erik Komnick",{"$f":"Formeln!A5","v":"MTV Boffzen"},{"$f":"IF(A9<>\"\",VLOOKUP(A9,'Wertungszettel M1'!A$7:B$36,2,0),\"\")","v":"04"},null,null,null,{"$f":"IF(AND(F9>0,F10>0),IF(OR(F9>10,F9<0,F10>10,F10<0),\"Fehler\",IF(ABS(D9)-ABS(E9)-(F9+F10)/2+10>0,IF(D9<0,-(ABS(D9)-ABS(E9)-(F9+F10)/2+10),D9-ABS(E9)-(F9+F10)/2+10),0)),0)","v":0},null,null,null,{"$f":"IF(AND(J9>0,J10>0),IF(OR(J9>10,J9<0,J10>10,J10<0),\"Fehler\",IF(ABS(H9)-ABS(I9)-(J9+J10)/2+10>0,IF(H9<0,-(ABS(H9)-ABS(I9)-(J9+J10)/2+10),H9-ABS(I9)-(J9+J10)/2+10),0)),0)","v":0},null,null,null,{"$f":"IF(AND(N9>0,N10>0),IF(OR(N9>10,N9<0,N10>10,N10<0),\"Fehler\",IF(ABS(L9)-ABS(M9)-(N9+N10)/2+10>0,IF(L9<0,-(ABS(L9)-ABS(M9)-(N9+N10)/2+10),L9-ABS(M9)-(N9+N10)/2+10),0)),0)","v":0},null,null,null,{"$f":"IF(AND(R9>0,R10>0),IF(OR(R9>10,R9<0,R10>10,R10<0),\"Fehler\",IF(ABS(P9)-ABS(Q9)-(R9+R10)/2+10>0,IF(P9<0,-(ABS(P9)-ABS(Q9)-(R9+R10)/2+10),P9-ABS(Q9)-(R9+R10)/2+10),0)),0)","v":0},null,null,null,{"$f":"IF(AND(V9>0,V10>0),IF(OR(V9>10,V9<0,V10>10,V10<0),\"Fehler\",IF(ABS(T9)-ABS(U9)-(V9+V10)/2+10>0,IF(T9<0,-(ABS(T9)-ABS(U9)-(V9+V10)/2+10),T9-ABS(U9)-(V9+V10)/2+10),0)),0)","v":0},null,null,null,{"$f":"IF(AND(Z9>0,Z10>0),IF(OR(Z9>10,Z9<0,Z10>10,Z10<0),\"Fehler\",IF(ABS(X9)-ABS(Y9)-(Z9+Z10)/2+10>0,IF(X9<0,-(ABS(X9)-ABS(Y9)-(Z9+Z10)/2+10),X9-ABS(Y9)-(Z9+Z10)/2+10),0)),0)","v":0},{"$f":"ABS(G9)+ABS(K9)+ABS(O9)+ABS(S9)+ABS(W9)+ABS(AA9)","v":0}]
[]
["Moritz Böhm",{"$f":"IF(A11>0,B9,\"\")","v":"MTV Boffzen"},{"$f":"IF(A11<>\"\",VLOOKUP(A11,'Wertungszettel M1'!A$7:B$36,2,0),\"\")","v":"04"},5,null,2.2999999999999998,{"$f":"IF(AND(F11>0,F12>0),IF(OR(F11>10,F11<0,F12>10,F12<0),\"Fehler\",IF(ABS(D11)-ABS(E11)-(F11+F12)/2+10>0,IF(D11<0,-(ABS(D11)-ABS(E11)-(F11+F12)/2+10),D11-ABS(E11)-(F11+F12)/2+10),0)),0)","v":12.7},6,null,3.2,{"$f":"IF(AND(J11>0,J12>0),IF(OR(J11>10,J11<0,J12>10,J12<0),\"Fehler\",IF(ABS(H11)-ABS(I11)-(J11+J12)/2+10>0,IF(H11<0,-(ABS(H11)-ABS(I11)-(J11+J12)/2+10),H11-ABS(I11)-(J11+J12)/2+10),0)),0)","v":12.7},6,1,2.2000000000000002,{"$f":"IF(AND(N11>0,N12>0),IF(OR(N11>10,N11<0,N12>10,N12<0),\"Fehler\",IF(ABS(L11)-ABS(M11)-(N11+N12)/2+10>0,IF(L11<0,-(ABS(L11)-ABS(M11)-(N11+N12)/2+10),L11-ABS(M11)-(N11+N12)/2+10),0)),0)","v":12.9},5,null,1.4,{"$f":"IF(AND(R11>0,R12>0),IF(OR(R11>10,R11<0,R12>10,R12<0),\"Fehler\",IF(ABS(P11)-ABS(Q11)-(R11+R12)/2+10>0,IF(P11<0,-(ABS(P11)-ABS(Q11)-(R11+R12)/2+10),P11-ABS(Q11)-(R11+R12)/2+10),0)),0)","v":13.55},6,null,2.8,{"$f":"IF(AND(V11>0,V12>0),IF(OR(V11>10,V11<0,V12>10,V12<0),\"Fehler\",IF(ABS(T11)-ABS(U11)-(V11+V12)/2+10>0,IF(T11<0,-(ABS(T11)-ABS(U11)-(V11+V12)/2+10),T11-ABS(U11)-(V11+V12)/2+10),0)),0)","v":13.1},6,null,8,{"$f":"IF(AND(Z11>0,Z12>0),IF(OR(Z11>10,Z11<0,Z12>10,Z12<0),\"Fehler\",IF(ABS(X11)-ABS(Y11)-(Z11+Z12)/2+10>0,IF(X11<0,-(ABS(X11)-ABS(Y11)-(Z11+Z12)/2+10),X11-ABS(Y11)-(Z11+Z12)/2+10),0)),0)","v":8},{"$f":"ABS(G11)+ABS(K11)+ABS(O11)+ABS(S11)+ABS(W11)+ABS(AA11)","v":72.949999999999989},null,null,null,"Boden",{"$f":"IF(G30>1,1,0)","v":1}]
[null,null,null,null,null,2.2999999999999998,null,null,null,3.4,null,null,null,2,null,null,null,1.5,null,null,null,3,null,null,null,8,null,null,null,null,null,"pauschenpferd",{"$f":"IF(K30>1,1,0)","v":1}]
["Marc Ormann",{"$f":"IF(A13>0,B11,\"\")","v":"MTV Boffzen"},{"$f":"IF(A13<>\"\",VLOOKUP(A13,'Wertungszettel M1'!A$7:B$36,2,0),\"\")","v":"04"},7,null,2,{"$f":"IF(AND(F13>0,F14>0),IF(OR(F13>10,F13<0,F14>10,F14<0),\"Fehler\",IF(ABS(D13)-ABS(E13)-(F13+F14)/2+10>0,IF(D13<0,-(ABS(D13)-ABS(E13)-(F13+F14)/2+10),D13-ABS(E13)-(F13+F14)/2+10),0)),0)","v":14.9},7,null,2.6,{"$f":"IF(AND(J13>0,J14>0),IF(OR(J13>10,J13<0,J14>10,J14<0),\"Fehler\",IF(ABS(H13)-ABS(I13)-(J13+J14)/2+10>0,IF(H13<0,-(ABS(H13)-ABS(I13)-(J13+J14)/2+10),H13-ABS(I13)-(J13+J14)/2+10),0)),0)","v":14.3},6,null,2.2000000000000002,{"$f":"IF(AND(N13>0,N14>0),IF(OR(N13>10,N13<0,N14>10,N14<0),\"Fehler\",IF(ABS(L13)-ABS(M13)-(N13+N14)/2+10>0,IF(L13<0,-(ABS(L13)-ABS(M13)-(N13+N14)/2+10),L13-ABS(M13)-(N13+N14)/2+10),0)),0)","v":13.8},7,null,3.2,{"$f":"IF(AND(R13>0,R14>0),IF(OR(R13>10,R13<0,R14>10,R14<0),\"Fehler\",IF(ABS(P13)-ABS(Q13)-(R13+R14)/2+10>0,IF(P13<0,-(ABS(P13)-ABS(Q13)-(R13+R14)/2+10),P13-ABS(Q13)-(R13+R14)/2+10),0)),0)","v":13.8},7,null,2.8,{"$f":"IF(AND(V13>0,V14>0),IF(OR(V13>10,V13<0,V14>10,V14<0),\"Fehler\",IF(ABS(T13)-ABS(U13)-(V13+V14)/2+10>0,IF(T13<0,-(ABS(T13)-ABS(U13)-(V13+V14)/2+10),T13-ABS(U13)-(V13+V14)/2+10),0)),0)","v":14.15},6,null,3.4,{"$f":"IF(AND(Z13>0,Z14>0),IF(OR(Z13>10,Z13<0,Z14>10,Z14<0),\"Fehler\",IF(ABS(X13)-ABS(Y13)-(Z13+Z14)/2+10>0,IF(X13<0,-(ABS(X13)-ABS(Y13)-(Z13+Z14)/2+10),X13-ABS(Y13)-(Z13+Z14)/2+10),0)),0)","v":12.45},{"$f":"ABS(G13)+ABS(K13)+ABS(O13)+ABS(S13)+ABS(W13)+ABS(AA13)","v":83.4},null,null,null,"ringe",{"$f":"IF(O30>1,1,0)","v":1}]
[null,null,null,null,null,2.2000000000000002,null,null,null,2.8,null,null,null,2.2000000000000002,null,null,null,3.2,null,null,null,2.9,null,null,null,3.7,null,null,null,null,null,"sprung",{"$f":"IF(S30>1,1,0)","v":1}]
["Erik Schäfer",{"$f":"IF(A15>0,B13,\"\")","v":"MTV Boffzen"},{"$f":"IF(A15<>\"\",VLOOKUP(A15,'Wertungszettel M1'!A$7:B$36,2,0),\"\")","v":"05"},6,null,2.7,{"$f":"IF(AND(F15>0,F16>0),IF(OR(F15>10,F15<0,F16>10,F16<0),\"Fehler\",IF(ABS(D15)-ABS(E15)-(F15+F16)/2+10>0,IF(D15<0,-(ABS(D15)-ABS(E15)-(F15+F16)/2+10),D15-ABS(E15)-(F15+F16)/2+10),0)),0)","v":13.3},6,null,3.4,{"$f":"IF(AND(J15>0,J16>0),IF(OR(J15>10,J15<0,J16>10,J16<0),\"Fehler\",IF(ABS(H15)-ABS(I15)-(J15+J16)/2+10>0,IF(H15<0,-(ABS(H15)-ABS(I15)-(J15+J16)/2+10),H15-ABS(I15)-(J15+J16)/2+10),0)),0)","v":12.65},6,null,2.7,{"$f":"IF(AND(N15>0,N16>0),IF(OR(N15>10,N15<0,N16>10,N16<0),\"Fehler\",IF(ABS(L15)-ABS(M15)-(N15+N16)/2+10>0,IF(L15<0,-(ABS(L15)-ABS(M15)-(N15+N16)/2+10),L15-ABS(M15)-(N15+N16)/2+10),0)),0)","v":13.25},7,null,4,{"$f":"IF(AND(R15>0,R16>0),IF(OR(R15>10,R15<0,R16>10,R16<0),\"Fehler\",IF(ABS(P15)-ABS(Q15)-(R15+R16)/2+10>0,IF(P15<0,-(ABS(P15)-ABS(Q15)-(R15+R16)/2+10),P15-ABS(Q15)-(R15+R16)/2+10),0)),0)","v":13},6,null,2.8,{"$f":"IF(AND(V15>0,V16>0),IF(OR(V15>10,V15<0,V16>10,V16<0),\"Fehler\",IF(ABS(T15)-ABS(U15)-(V15+V16)/2+10>0,IF(T15<0,-(ABS(T15)-ABS(U15)-(V15+V16)/2+10),T15-ABS(U15)-(V15+V16)/2+10),0)),0)","v":13.05},5,null,1.5,{"$f":"IF(AND(Z15>0,Z16>0),IF(OR(Z15>10,Z15<0,Z16>10,Z16<0),\"Fehler\",IF(ABS(X15)-ABS(Y15)-(Z15+Z16)/2+10>0,IF(X15<0,-(ABS(X15)-ABS(Y15)-(Z15+Z16)/2+10),X15-ABS(Y15)-(Z15+Z16)/2+10),0)),0)","v":13.5},{"$f":"ABS(G15)+ABS(K15)+ABS(O15)+ABS(S15)+ABS(W15)+ABS(AA15)","v":78.75},null,null,null,"Barren",{"$f":"IF(W30>1,1,0)","v":1}]
[null,null,null,null,null,2.7,null,null,null,3.3,null,null,null,2.8,null,null,null,4,null,null,null,3.1,null,null,null,1.5,null,null,null,null,null,"Reck",{"$f":"IF(AA30>1,1,0)","v":1}]
["Emil Meisner",{"$f":"IF(A17>0,B15,\"\")","v":"MTV Boffzen"},{"$f":"IF(A17<>\"\",VLOOKUP(A17,'Wertungszettel M1'!A$7:B$36,2,0),\"\")","v":"06"},5,null,2.6,{"$f":"IF(AND(F17>0,F18>0),IF(OR(F17>10,F17<0,F18>10,F18<0),\"Fehler\",IF(ABS(D17)-ABS(E17)-(F17+F18)/2+10>0,IF(D17<0,-(ABS(D17)-ABS(E17)-(F17+F18)/2+10),D17-ABS(E17)-(F17+F18)/2+10),0)),0)","v":12.5},5,null,2,{"$f":"IF(AND(J17>0,J18>0),IF(OR(J17>10,J17<0,J18>10,J18<0),\"Fehler\",IF(ABS(H17)-ABS(I17)-(J17+J18)/2+10>0,IF(H17<0,-(ABS(H17)-ABS(I17)-(J17+J18)/2+10),H17-ABS(I17)-(J17+J18)/2+10),0)),0)","v":13},5,0.5,1.5,{"$f":"IF(AND(N17>0,N18>0),IF(OR(N17>10,N17<0,N18>10,N18<0),\"Fehler\",IF(ABS(L17)-ABS(M17)-(N17+N18)/2+10>0,IF(L17<0,-(ABS(L17)-ABS(M17)-(N17+N18)/2+10),L17-ABS(M17)-(N17+N18)/2+10),0)),0)","v":13},5,null,1.8,{"$f":"IF(AND(R17>0,R18>0),IF(OR(R17>10,R17<0,R18>10,R18<0),\"Fehler\",IF(ABS(P17)-ABS(Q17)-(R17+R18)/2+10>0,IF(P17<0,-(ABS(P17)-ABS(Q17)-(R17+R18)/2+10),P17-ABS(Q17)-(R17+R18)/2+10),0)),0)","v":13.25},5,null,2.2000000000000002,{"$f":"IF(AND(V17>0,V18>0),IF(OR(V17>10,V17<0,V18>10,V18<0),\"Fehler\",IF(ABS(T17)-ABS(U17)-(V17+V18)/2+10>0,IF(T17<0,-(ABS(T17)-ABS(U17)-(V17+V18)/2+10),T17-ABS(U17)-(V17+V18)/2+10),0)),0)","v":12.8},5,null,2.2999999999999998,{"$f":"IF(AND(Z17>0,Z18>0),IF(OR(Z17>10,Z17<0,Z18>10,Z18<0),\"Fehler\",IF(ABS(X17)-ABS(Y17)-(Z17+Z18)/2+10>0,IF(X17<0,-(ABS(X17)-ABS(Y17)-(Z17+Z18)/2+10),X17-ABS(Y17)-(Z17+Z18)/2+10),0)),0)","v":12.55},{"$f":"ABS(G17)+ABS(K17)+ABS(O17)+ABS(S17)+ABS(W17)+ABS(AA17)","v":77.099999999999994}]
[null,null,null,null,null,2.4,null,null,null,2,null,null,null,1.5,null,null,null,1.7,null,null,null,2.2000000000000002,null,null,null,2.6,null,null,null,null,null,"Gesamt",{"$f":"SUM(AG11:AG17)","v":6}]
[null,{"$f":"IF(A19>0,B17,\"\")","v":""},{"$f":"IF(A19<>\"\",VLOOKUP(A19,'Wertungszettel M1'!A$7:B$36,2,0),\"\")","v":""},null,null,null,{"$f":"IF(AND(F19>0,F20>0),IF(OR(F19>10,F19<0,F20>10,F20<0),\"Fehler\",IF(ABS(D19)-ABS(E19)-(F19+F20)/2+10>0,IF(D19<0,-(ABS(D19)-ABS(E19)-(F19+F20)/2+10),D19-ABS(E19)-(F19+F20)/2+10),0)),0)","v":0},null,null,null,{"$f":"IF(AND(J19>0,J20>0),IF(OR(J19>10,J19<0,J20>10,J20<0),\"Fehler\",IF(ABS(H19)-ABS(I19)-(J19+J20)/2+10>0,IF(H19<0,-(ABS(H19)-ABS(I19)-(J19+J20)/2+10),H19-ABS(I19)-(J19+J20)/2+10),0)),0)","v":0},null,null,null,{"$f":"IF(AND(N19>0,N20>0),IF(OR(N19>10,N19<0,N20>10,N20<0),\"Fehler\",IF(ABS(L19)-ABS(M19)-(N19+N20)/2+10>0,IF(L19<0,-(ABS(L19)-ABS(M19)-(N19+N20)/2+10),L19-ABS(M19)-(N19+N20)/2+10),0)),0)","v":0},null,null,null,{"$f":"IF(AND(R19>0,R20>0),IF(OR(R19>10,R19<0,R20>10,R20<0),\"Fehler\",IF(ABS(P19)-ABS(Q19)-(R19+R20)/2+10>0,IF(P19<0,-(ABS(P19)-ABS(Q19)-(R19+R20)/2+10),P19-ABS(Q19)-(R19+R20)/2+10),0)),0)","v":0},null,null,null,{"$f":"IF(AND(V19>0,V20>0),IF(OR(V19>10,V19<0,V20>10,V20<0),\"Fehler\",IF(ABS(T19)-ABS(U19)-(V19+V20)/2+10>0,IF(T19<0,-(ABS(T19)-ABS(U19)-(V19+V20)/2+10),T19-ABS(U19)-(V19+V20)/2+10),0)),0)","v":0},null,null,null,{"$f":"IF(AND(Z19>0,Z20>0),IF(OR(Z19>10,Z19<0,Z20>10,Z20<0),\"Fehler\",IF(ABS(X19)-ABS(Y19)-(Z19+Z20)/2+10>0,IF(X19<0,-(ABS(X19)-ABS(Y19)-(Z19+Z20)/2+10),X19-ABS(Y19)-(Z19+Z20)/2+10),0)),0)","v":0},{"$f":"ABS(G19)+ABS(K19)+ABS(O19)+ABS(S19)+ABS(W19)+ABS(AA19)","v":0}]
[]
[null,{"$f":"IF(A21>0,B19,\"\")","v":""},{"$f":"IF(A21<>\"\",VLOOKUP(A21,'Wertungszettel M1'!A$7:B$36,2,0),\"\")","v":""},null,null,null,{"$f":"IF(AND(F21>0,F22>0),IF(OR(F21>10,F21<0,F22>10,F22<0),\"Fehler\",IF(ABS(D21)-ABS(E21)-(F21+F22)/2+10>0,IF(D21<0,-(ABS(D21)-ABS(E21)-(F21+F22)/2+10),D21-ABS(E21)-(F21+F22)/2+10),0)),0)","v":0},null,null,null,{"$f":"IF(AND(J21>0,J22>0),IF(OR(J21>10,J21<0,J22>10,J22<0),\"Fehler\",IF(ABS(H21)-ABS(I21)-(J21+J22)/2+10>0,IF(H21<0,-(ABS(H21)-ABS(I21)-(J21+J22)/2+10),H21-ABS(I21)-(J21+J22)/2+10),0)),0)","v":0},null,null,null,{"$f":"IF(AND(N21>0,N22>0),IF(OR(N21>10,N21<0,N22>10,N22<0),\"Fehler\",IF(ABS(L21)-ABS(M21)-(N21+N22)/2+10>0,IF(L21<0,-(ABS(L21)-ABS(M21)-(N21+N22)/2+10),L21-ABS(M21)-(N21+N22)/2+10),0)),0)","v":0},null,null,null,{"$f":"IF(AND(R21>0,R22>0),IF(OR(R21>10,R21<0,R22>10,R22<0),\"Fehler\",IF(ABS(P21)-ABS(Q21)-(R21+R22)/2+10>0,IF(P21<0,-(ABS(P21)-ABS(Q21)-(R21+R22)/2+10),P21-ABS(Q21)-(R21+R22)/2+10),0)),0)","v":0},null,null,null,{"$f":"IF(AND(V21>0,V22>0),IF(OR(V21>10,V21<0,V22>10,V22<0),\"Fehler\",IF(ABS(T21)-ABS(U21)-(V21+V22)/2+10>0,IF(T21<0,-(ABS(T21)-ABS(U21)-(V21+V22)/2+10),T21-ABS(U21)-(V21+V22)/2+10),0)),0)","v":0},null,null,null,{"$f":"IF(AND(Z21>0,Z22>0),IF(OR(Z21>10,Z21<0,Z22>10,Z22<0),\"Fehler\",IF(ABS(X21)-ABS(Y21)-(Z21+Z22)/2+10>0,IF(X21<0,-(ABS(X21)-ABS(Y21)-(Z21+Z22)/2+10),X21-ABS(Y21)-(Z21+Z22)/2+10),0)),0)","v":0},{"$f":"ABS(G21)+ABS(K21)+ABS(O21)+ABS(S21)+ABS(W21)+ABS(AA21)","v":0}]
[]
[null,{"$f":"IF(A23>0,B21,\"\")","v":""},{"$f":"IF(A23<>\"\",VLOOKUP(A23,'Wertungszettel M1'!A$7:B$36,2,0),\"\")","v":""},null,null,null,{"$f":"IF(AND(F23>0,F24>0),IF(OR(F23>10,F23<0,F24>10,F24<0),\"Fehler\",IF(ABS(D23)-ABS(E23)-(F23+F24)/2+10>0,IF(D23<0,-(ABS(D23)-ABS(E23)-(F23+F24)/2+10),D23-ABS(E23)-(F23+F24)/2+10),0)),0)","v":0},null,null,null,{"$f":"IF(AND(J23>0,J24>0),IF(OR(J23>10,J23<0,J24>10,J24<0),\"Fehler\",IF(ABS(H23)-ABS(I23)-(J23+J24)/2+10>0,IF(H23<0,-(ABS(H23)-ABS(I23)-(J23+J24)/2+10),H23-ABS(I23)-(J23+J24)/2+10),0)),0)","v":0},null,null,null,{"$f":"IF(AND(N23>0,N24>0),IF(OR(N23>10,N23<0,N24>10,N24<0),\"Fehler\",IF(ABS(L23)-ABS(M23)-(N23+N24)/2+10>0,IF(L23<0,-(ABS(L23)-ABS(M23)-(N23+N24)/2+10),L23-ABS(M23)-(N23+N24)/2+10),0)),0)","v":0},null,null,null,{"$f":"IF(AND(R23>0,R24>0),IF(OR(R23>10,R23<0,R24>10,R24<0),\"Fehler\",IF(ABS(P23)-ABS(Q23)-(R23+R24)/2+10>0,IF(P23<0,-(ABS(P23)-ABS(Q23)-(R23+R24)/2+10),P23-ABS(Q23)-(R23+R24)/2+10),0)),0)","v":0},null,null,null,{"$f":"IF(AND(V23>0,V24>0),IF(OR(V23>10,V23<0,V24>10,V24<0),\"Fehler\",IF(ABS(T23)-ABS(U23)-(V23+V24)/2+10>0,IF(T23<0,-(ABS(T23)-ABS(U23)-(V23+V24)/2+10),T23-ABS(U23)-(V23+V24)/2+10),0)),0)","v":0},null,null,null,{"$f":"IF(AND(Z23>0,Z24>0),IF(OR(Z23>10,Z23<0,Z24>10,Z24<0),\"Fehler\",IF(ABS(X23)-ABS(Y23)-(Z23+Z24)/2+10>0,IF(X23<0,-(ABS(X23)-ABS(Y23)-(Z23+Z24)/2+10),X23-ABS(Y23)-(Z23+Z24)/2+10),0)),0)","v":0},{"$f":"ABS(G23)+ABS(K23)+ABS(O23)+ABS(S23)+ABS(W23)+ABS(AA23)","v":0}]
[]
[null,{"$f":"IF(A25>0,B23,\"\")","v":""},{"$f":"IF(A25<>\"\",VLOOKUP(A25,'Wertungszettel M1'!A$7:B$36,2,0),\"\")","v":""},null,null,null,{"$f":"IF(AND(F25>0,F26>0),IF(OR(F25>10,F25<0,F26>10,F26<0),\"Fehler\",IF(ABS(D25)-ABS(E25)-(F25+F26)/2+10>0,IF(D25<0,-(ABS(D25)-ABS(E25)-(F25+F26)/2+10),D25-ABS(E25)-(F25+F26)/2+10),0)),0)","v":0},null,null,null,{"$f":"IF(AND(J25>0,J26>0),IF(OR(J25>10,J25<0,J26>10,J26<0),\"Fehler\",IF(ABS(H25)-ABS(I25)-(J25+J26)/2+10>0,IF(H25<0,-(ABS(H25)-ABS(I25)-(J25+J26)/2+10),H25-ABS(I25)-(J25+J26)/2+10),0)),0)","v":0},null,null,null,{"$f":"IF(AND(N25>0,N26>0),IF(OR(N25>10,N25<0,N26>10,N26<0),\"Fehler\",IF(ABS(L25)-ABS(M25)-(N25+N26)/2+10>0,IF(L25<0,-(ABS(L25)-ABS(M25)-(N25+N26)/2+10),L25-ABS(M25)-(N25+N26)/2+10),0)),0)","v":0},null,null,null,{"$f":"IF(AND(R25>0,R26>0),IF(OR(R25>10,R25<0,R26>10,R26<0),\"Fehler\",IF(ABS(P25)-ABS(Q25)-(R25+R26)/2+10>0,IF(P25<0,-(ABS(P25)-ABS(Q25)-(R25+R26)/2+10),P25-ABS(Q25)-(R25+R26)/2+10),0)),0)","v":0},null,null,null,{"$f":"IF(AND(V25>0,V26>0),IF(OR(V25>10,V25<0,V26>10,V26<0),\"Fehler\",IF(ABS(T25)-ABS(U25)-(V25+V26)/2+10>0,IF(T25<0,-(ABS(T25)-ABS(U25)-(V25+V26)/2+10),T25-ABS(U25)-(V25+V26)/2+10),0)),0)","v":0},null,null,null,{"$f":"IF(AND(Z25>0,Z26>0),IF(OR(Z25>10,Z25<0,Z26>10,Z26<0),\"Fehler\",IF(ABS(X25)-ABS(Y25)-(Z25+Z26)/2+10>0,IF(X25<0,-(ABS(X25)-ABS(Y25)-(Z25+Z26)/2+10),X25-ABS(Y25)-(Z25+Z26)/2+10),0)),0)","v":0},{"$f":"ABS(G25)+ABS(K25)+ABS(O25)+ABS(S25)+ABS(W25)+ABS(AA25)","v":0}]
[]
[null,{"$f":"IF(A27>0,B25,\"\")","v":""},{"$f":"IF(A27<>\"\",VLOOKUP(A27,'Wertungszettel M1'!A$7:B$36,2,0),\"\")","v":""},null,null,null,{"$f":"IF(AND(F27>0,F28>0),IF(OR(F27>10,F27<0,F28>10,F28<0),\"Fehler\",IF(ABS(D27)-ABS(E27)-(F27+F28)/2+10>0,IF(D27<0,-(ABS(D27)-ABS(E27)-(F27+F28)/2+10),D27-ABS(E27)-(F27+F28)/2+10),0)),0)","v":0},null,null,null,{"$f":"IF(AND(J27>0,J28>0),IF(OR(J27>10,J27<0,J28>10,J28<0),\"Fehler\",IF(ABS(H27)-ABS(I27)-(J27+J28)/2+10>0,IF(H27<0,-(ABS(H27)-ABS(I27)-(J27+J28)/2+10),H27-ABS(I27)-(J27+J28)/2+10),0)),0)","v":0},null,null,null,{"$f":"IF(AND(N27>0,N28>0),IF(OR(N27>10,N27<0,N28>10,N28<0),\"Fehler\",IF(ABS(L27)-ABS(M27)-(N27+N28)/2+10>0,IF(L27<0,-(ABS(L27)-ABS(M27)-(N27+N28)/2+10),L27-ABS(M27)-(N27+N28)/2+10),0)),0)","v":0},null,null,null,{"$f":"IF(AND(R27>0,R28>0),IF(OR(R27>10,R27<0,R28>10,R28<0),\"Fehler\",IF(ABS(P27)-ABS(Q27)-(R27+R28)/2+10>0,IF(P27<0,-(ABS(P27)-ABS(Q27)-(R27+R28)/2+10),P27-ABS(Q27)-(R27+R28)/2+10),0)),0)","v":0},null,null,null,{"$f":"IF(AND(V27>0,V28>0),IF(OR(V27>10,V27<0,V28>10,V28<0),\"Fehler\",IF(ABS(T27)-ABS(U27)-(V27+V28)/2+10>0,IF(T27<0,-(ABS(T27)-ABS(U27)-(V27+V28)/2+10),T27-ABS(U27)-(V27+V28)/2+10),0)),0)","v":0},null,null,null,{"$f":"IF(AND(Z27>0,Z28>0),IF(OR(Z27>10,Z27<0,Z28>10,Z28<0),\"Fehler\",IF(ABS(X27)-ABS(Y27)-(Z27+Z28)/2+10>0,IF(X27<0,-(ABS(X27)-ABS(Y27)-(Z27+Z28)/2+10),X27-ABS(Y27)-(Z27+Z28)/2+10),0)),0)","v":0},{"$f":"ABS(G27)+ABS(K27)+ABS(O27)+ABS(S27)+ABS(W27)+ABS(AA27)","v":0}]
[]
[]
[null,null,null,null,null,null,{"$f":"SUM(LARGE(G9:G28,1),LARGE(G9:G28,2),LARGE(G9:G28,3))","v":40.900000000000006},null,null,null,{"$f":"SUM(LARGE(K9:K28,1),LARGE(K9:K28,2),LARGE(K9:K28,3))","v":40},null,null,null,{"$f":"SUM(LARGE(O9:O28,1),LARGE(O9:O28,2),LARGE(O9:O28,3))","v":40.049999999999997},null,null,null,{"$f":"SUM(LARGE(S9:S28,1),LARGE(S9:S28,2),LARGE(S9:S28,3))","v":40.6},null,null,null,{"$f":"SUM(LARGE(W9:W28,1),LARGE(W9:W28,2),LARGE(W9:W28,3))","v":40.299999999999997},null,null,null,{"$f":"SUM(LARGE(AA9:AA28,1),LARGE(AA9:AA28,2),LARGE(AA9:AA28,3))","v":38.5},{"$f":"SUM(G30,K30,O30,S30,W30,AA30)","v":240.35000000000002}]

{"sheet":"Einbeck 2","index":9,"n_rows":30,"n_cols":33,"rows_kept":30,"cut":false,"hidden":false,"merged":[[6,19,6,22],[6,23,6,26],[0,12,0,13],[2,0,2,1],[2,5,2,7],[2,12,2,13],[8,0,9,0],[8,1,9,1],[8,2,9,2],[8,3,9,3],[8,4,9,4],[6,3,6,6],[6,7,6,10],[6,11,6,14],[6,15,6,18],[8,6,9,6],[8,7,9,7],[8,8,9,8],[8,10,9,10],[8,11,9,11],[8,12,9,12],[4,14,4,16],[2,14,2,16],[0,14,0,16],[10,23,11,23],[10,24,11,24],[10,26,11,26],[8,22,9,22],[8,23,9,23],[8,24,9,24],[8,26,9,26],[8,27,9,27],[8,14,9,14],[8,15,9,15],[8,16,9,16],[8,18,9,18],[8,19,9,19],[8,20,9,20],[10,27,11,27],[10,22,11,22],[10,15,11,15],[12,0,13,0],[12,1,13,1],[12,2,13,2],[12,3,13,3],[10,14,11,14],[10,16,11,16],[10,18,11,18],[10,19,11,19],[10,20,11,20],[10,6,11,6],[10,7,11,7],[10,8,11,8],[10,10,11,10],[10,11,11,11],[10,12,11,12],[10,0,11,0],[10,1,11,1],[10,2,11,2],[10,3,11,3],[10,4,11,4],[12,20,13,20],[12,4,13,4],[12,6,13,6],[12,7,13,7],[12,22,13,22],[12,23,13,23],[12,24,13,24],[12,26,13,26],[14,26,15,26],[12,27,13,27],[12,12,13,12],[12,14,13,14],[12,15,13,15],[12,16,13,16],[12,18,13,18],[12,19,13,19],[14,27,15,27],[14,22,15,22],[14,23,15,23],[14,24,15,24],[16,0,17,0],[16,1,17,1],[16,2,17,2],[16,3,17,3],[16,4,17,4],[16,6,17,6],[14,18,15,18],[14,19,15,19],[14,20,15,20],[14,10,15,10],[14,11,15,11],[14,12,15,12],[14,14,15,14],[14,15,15,15],[14,16,15,16],[14,0,15,0],[14,1,15,1],[14,2,15,2],[14,3,15,3],[14,4,15,4],[14,6,15,6],[14,7,15,7],[14,8,15,8],[16,23,17,23],[16,24,17,24],[16,26,17,26],[16,27,17,27],[18,0,19,0],[18,1,19,1],[18,2,19,2],[18,3,19,3],[16,15,17,15],[16,16,17,16],[16,18,17,18],[16,19,17,19],[16,20,17,20],[16,22,17,22],[16,7,17,7],[16,8,17,8],[16,10,17,10],[16,11,17,11],[16,12,17,12],[16,14,17,14],[18,27,19,27],[18,12,19,12],[18,14,19,14],[18,15,19,15],[18,20,19,20],[18,22,19,22],[18,23,19,23],[18,24,19,24],[18,16,19,16],[18,18,19,18],[18,19,19,19],[18,4,19,4],[18,6,19,6],[18,7,19,7],[18,8,19,8],[18,10,19,10],[18,11,19,11],[18,26,19,26],[20,26,21,26],[20,27,21,27],[22,0,23,0],[22,1,23,1],[22,2,23,2],[22,3,23,3],[22,4,23,4],[22,6,23,6],[20,18,21,18],[20,19,21,19],[20,20,21,20],[20,22,21,22],[20,23,21,23],[20,24,21,24],[20,10,21,10],[20,11,21,11],[20,12,21,12],[20,14,21,14],[20,15,21,15],[22,23,23,23],[22,24,23,24],[22,26,23,26],[22,27,23,27],[22,22,23,22],[22,7,23,7],[22,8,23,8],[22,10,23,10],[22,11,23,11],[22,12,23,12],[22,14,23,14],[24,22,25,22],[24,23,25,23],[24,7,25,7],[24,8,25,8],[24,10,25,10],[24,11,25,11],[22,15,23,15],[22,16,23,16],[22,18,23,18],[22,19,23,19],[22,20,23,20],[24,24,25,24],[24,26,25,26],[26,26,27,26],[24,27,25,27],[24,12,25,12],[24,14,25,14],[24,15,25,15],[24,16,25,16],[24,18,25,18],[24,19,25,19],[26,27,27,27],[26,22,27,22],[26,23,27,23],[26,24,27,24],[24,20,25,20],[26,18,27,18],[26,19,27,19],[26,20,27,20],[26,0,27,0],[26,1,27,1],[26,2,27,2],[26,3,27,3],[26,4,27,4],[26,6,27,6],[26,7,27,7],[26,8,27,8],[20,0,21,0],[20,1,21,1],[20,2,21,2],[20,3,21,3],[24,0,25,0],[24,1,25,1],[24,2,25,2],[24,3,25,3],[24,4,25,4],[24,6,25,6],[20,4,21,4],[20,6,21,6],[20,7,21,7],[20,8,21,8],[12,8,13,8],[12,10,13,10],[12,11,13,11],[26,10,27,10],[26,11,27,11],[26,12,27,12],[26,14,27,14],[26,15,27,15],[26,16,27,16],[20,16,21,16]]}
["Wettkampfbogen",null,null,null,null,null,null,null,null,null,null,null,"Datum:",null,{"$f":"'INFO Blatt'!B13","v":"2018-03-03"}]
[]
[null,null,null,null,null,null,null,null,null,null,null,null,"Ort:",null,{"$f":"'INFO Blatt'!B11","v":"Hehlen"}]
[]
[null,null,null,null,null,null,null,null,null,null,null,null,null,"Liga:",{"$f":"'INFO Blatt'!B7","v":"Schülerliga Süd"}]
[]
["Name","Verein","Jg","Boden",null,null,null,"Pferd",null,null,null,"Ringe",null,null,null,"Sprung",null,null,null,"Barren",null,null,null,"Reck",null,null,null,"Ges."]
[null,null,null,"D-Note","Abzug OK","E- Abzug","Note","D-Note","Abzug OK","E- Abzug","Note","D-Note","Abzug OK","E-Abzug","Note","D-Note","Abzug OK","E-Abzug","Note","D-Note","Abzug OK","E-Abzug","Note","D-Note","Abzug OK","E-Abzug","Note"]
["Wiliam Lampe",{"$f":"Formeln!A10","v":"Einbecker SV 2"},{"$f":"IF(A9<>\"\", VLOOKUP(A9,'Wertungszettel M6'!A$7:B$36,2,0),\"\")","v":"07"},8,null,2.4,{"$f":"IF(AND(F9>0,F10>0),IF(OR(F9>10,F9<0,F10>10,F10<0),\"Fehler\",IF(ABS(D9)-ABS(E9)-(F9+F10)/2+10>0,IF(D9<0,-(ABS(D9)-ABS(E9)-(F9+F10)/2+10),D9-ABS(E9)-(F9+F10)/2+10),0)),0)","v":15.6},6,null,2.8,{"$f":"IF(AND(J9>0,J10>0),IF(OR(J9>10,J9<0,J10>10,J10<0),\"Fehler\",IF(ABS(H9)-ABS(I9)-(J9+J10)/2+10>0,IF(H9<0,-(ABS(H9)-ABS(I9)-(J9+J10)/2+10),H9-ABS(I9)-(J9+J10)/2+10),0)),0)","v":13.15},6,null,1.2,{"$f":"IF(AND(N9>0,N10>0),IF(OR(N9>10,N9<0,N10>10,N10<0),\"Fehler\",IF(ABS(L9)-ABS(M9)-(N9+N10)/2+10>0,IF(L9<0,-(ABS(L9)-ABS(M9)-(N9+N10)/2+10),L9-ABS(M9)-(N9+N10)/2+10),0)),0)","v":14.8},7,null,2.9,{"$f":"IF(AND(R9>0,R10>0),IF(OR(R9>10,R9<0,R10>10,R10<0),\"Fehler\",IF(ABS(P9)-ABS(Q9)-(R9+R10)/2+10>0,IF(P9<0,-(ABS(P9)-ABS(Q9)-(R9+R10)/2+10),P9-ABS(Q9)-(R9+R10)/2+10),0)),0)","v":14.1},6,null,2.5,{"$f":"IF(AND(V9>0,V10>0),IF(OR(V9>10,V9<0,V10>10,V10<0),\"Fehler\",IF(ABS(T9)-ABS(U9)-(V9+V10)/2+10>0,IF(T9<0,-(ABS(T9)-ABS(U9)-(V9+V10)/2+10),T9-ABS(U9)-(V9+V10)/2+10),0)),0)","v":13.65},6,null,2.5,{"$f":"IF(AND(Z9>0,Z10>0),IF(OR(Z9>10,Z9<0,Z10>10,Z10<0),\"Fehler\",IF(ABS(X9)-ABS(Y9)-(Z9+Z10)/2+10>0,IF(X9<0,-(ABS(X9)-ABS(Y9)-(Z9+Z10)/2+10),X9-ABS(Y9)-(Z9+Z10)/2+10),0)),0)","v":13.5},{"$f":"ABS(G9)+ABS(K9)+ABS(O9)+ABS(S9)+ABS(W9)+ABS(AA9)","v":84.8}]
[null,null,null,null,null,2.4,null,null,null,2.9,null,null,null,1.2,null,null,null,2.9,null,null,null,2.2000000000000002,null,null,null,2.5]
["Dominik Kumarasamy",{"$f":"IF(A11>0,B9,\"\")","v":"Einbecker SV 2"},{"$f":"IF(A11<>\"\", VLOOKUP(A11,'Wertungszettel M6'!A$7:B$36,2,0),\"\")","v":"07"},8,null,2.7,{"$f":"IF(AND(F11>0,F12>0),IF(OR(F11>10,F11<0,F12>10,F12<0),\"Fehler\",IF(ABS(D11)-ABS(E11)-(F11+F12)/2+10>0,IF(D11<0,-(ABS(D11)-ABS(E11)-(F11+F12)/2+10),D11-ABS(E11)-(F11+F12)/2+10),0)),0)","v":15.3},6,null,2.1,{"$f":"IF(AND(J11>0,J12>0),IF(OR(J11>10,J11<0,J12>10,J12<0),\"Fehler\",IF(ABS(H11)-ABS(I11)-(J11+J12)/2+10>0,IF(H11<0,-(ABS(H11)-ABS(I11)-(J11+J12)/2+10),H11-ABS(I11)-(J11+J12)/2+10),0)),0)","v":13.9},6,null,2.2000000000000002,{"$f":"IF(AND(N11>0,N12>0),IF(OR(N11>10,N11<0,N12>10,N12<0),\"Fehler\",IF(ABS(L11)-ABS(M11)-(N11+N12)/2+10>0,IF(L11<0,-(ABS(L11)-ABS(M11)-(N11+N12)/2+10),L11-ABS(M11)-(N11+N12)/2+10),0)),0)","v":13.8},7,null,1.5,{"$f":"IF(AND(R11>0,R12>0),IF(OR(R11>10,R11<0,R12>10,R12<0),\"Fehler\",IF(ABS(P11)-ABS(Q11)-(R11+R12)/2+10>0,IF(P11<0,-(ABS(P11)-ABS(Q11)-(R11+R12)/2+10),P11-ABS(Q11)-(R11+R12)/2+10),0)),0)","v":15.5},6,null,1.5,{"$f":"IF(AND(V11>0,V12>0),IF(OR(V11>10,V11<0,V12>10,V12<0),\"Fehler\",IF(ABS(T11)-ABS(U11)-(V11+V12)/2+10>0,IF(T11<0,-(ABS(T11)-ABS(U11)-(V11+V12)/2+10),T11-ABS(U11)-(V11+V12)/2+10),0)),0)","v":14.4},6,null,1.9,{"$f":"IF(AND(Z11>0,Z12>0),IF(OR(Z11>10,Z11<0,Z12>10,Z12<0),\"Fehler\",IF(ABS(X11)-ABS(Y11)-(Z11+Z12)/2+10>0,IF(X11<0,-(ABS(X11)-ABS(Y11)-(Z11+Z12)/2+10),X11-ABS(Y11)-(Z11+Z12)/2+10),0)),0)","v":14},{"$f":"ABS(G11)+ABS(K11)+ABS(O11)+ABS(S11)+ABS(W11)+ABS(AA11)","v":86.9},null,null,null,"Boden",{"$f":"IF(G30>1,1,0)","v":1}]
[null,null,null,null,null,2.7,null,null,null,2.1,null,null,null,2.2000000000000002,null,null,null,1.5,null,null,null,1.7,null,null,null,2.1,null,null,null,null,null,"pauschenpferd",{"$f":"IF(K30>1,1,0)","v":1}]
["Leon Freye",{"$f":"IF(A13>0,B11,\"\")","v":"Einbecker SV 2"},{"$f":"IF(A13<>\"\", VLOOKUP(A13,'Wertungszettel M6'!A$7:B$36,2,0),\"\")","v":"07"},8,null,1.5,{"$f":"IF(AND(F13>0,F14>0),IF(OR(F13>10,F13<0,F14>10,F14<0),\"Fehler\",IF(ABS(D13)-ABS(E13)-(F13+F14)/2+10>0,IF(D13<0,-(ABS(D13)-ABS(E13)-(F13+F14)/2+10),D13-ABS(E13)-(F13+F14)/2+10),0)),0)","v":16.45},7,null,2.5,{"$f":"IF(AND(J13>0,J14>0),IF(OR(J13>10,J13<0,J14>10,J14<0),\"Fehler\",IF(ABS(H13)-ABS(I13)-(J13+J14)/2+10>0,IF(H13<0,-(ABS(H13)-ABS(I13)-(J13+J14)/2+10),H13-ABS(I13)-(J13+J14)/2+10),0)),0)","v":14.45},7,null,1.6,{"$f":"IF(AND(N13>0,N14>0),IF(OR(N13>10,N13<0,N14>10,N14<0),\"Fehler\",IF(ABS(L13)-ABS(M13)-(N13+N14)/2+10>0,IF(L13<0,-(ABS(L13)-ABS(M13)-(N13+N14)/2+10),L13-ABS(M13)-(N13+N14)/2+10),0)),0)","v":15.4},7,null,2.4,{"$f":"IF(AND(R13>0,R14>0),IF(OR(R13>10,R13<0,R14>10,R14<0),\"Fehler\",IF(ABS(P13)-ABS(Q13)-(R13+R14)/2+10>0,IF(P13<0,-(ABS(P13)-ABS(Q13)-(R13+R14)/2+10),P13-ABS(Q13)-(R13+R14)/2+10),0)),0)","v":14.6},6,null,1.5,{"$f":"IF(AND(V13>0,V14>0),IF(OR(V13>10,V13<0,V14>10,V14<0),\"Fehler\",IF(ABS(T13)-ABS(U13)-(V13+V14)/2+10>0,IF(T13<0,-(ABS(T13)-ABS(U13)-(V13+V14)/2+10),T13-ABS(U13)-(V13+V14)/2+10),0)),0)","v":14.6},6,null,0.6,{"$f":"IF(AND(Z13>0,Z14>0),IF(OR(Z13>10,Z13<0,Z14>10,Z14<0),\"Fehler\",IF(ABS(X13)-ABS(Y13)-(Z13+Z14)/2+10>0,IF(X13<0,-(ABS(X13)-ABS(Y13)-(Z13+Z14)/2+10),X13-ABS(Y13)-(Z13+Z14)/2+10),0)),0)","v":15.4},{"$f":"ABS(G13)+ABS(K13)+ABS(O13)+ABS(S13)+ABS(W13)+ABS(AA13)","v":90.9},null,null,null,"ringe",{"$f":"IF(O30>1,1,0)","v":1}]
[null,null,null,null,null,1.6,null,null,null,2.6,null,null,null,1.6,null,null,null,2.4,null,null,null,1.3,null,null,null,0.6,null,null,null,null,null,"sprung",{"$f":"IF(S30>1,1,0)","v":1}]
["Johann Mickat",{"$f":"IF(A15>0,B13,\"\")","v":"Einbecker SV 2"},{"$f":"IF(A15<>\"\", VLOOKUP(A15,'Wertungszettel M6'!A$7:B$36,2,0),\"\")","v":"06"},null,null,null,{"$f":"IF(AND(F15>0,F16>0),IF(OR(F15>10,F15<0,F16>10,F16<0),\"Fehler\",IF(ABS(D15)-ABS(E15)-(F15+F16)/2+10>0,IF(D15<0,-(ABS(D15)-ABS(E15)-(F15+F16)/2+10),D15-ABS(E15)-(F15+F16)/2+10),0)),0)","v":0},7,null,2.2999999999999998,{"$f":"IF(AND(J15>0,J16>0),IF(OR(J15>10,J15<0,J16>10,J16<0),\"Fehler\",IF(ABS(H15)-ABS(I15)-(J15+J16)/2+10>0,IF(H15<0,-(ABS(H15)-ABS(I15)-(J15+J16)/2+10),H15-ABS(I15)-(J15+J16)/2+10),0)),0)","v":14.75},8,null,2.2000000000000002,{"$f":"IF(AND(N15>0,N16>0),IF(OR(N15>10,N15<0,N16>10,N16<0),\"Fehler\",IF(ABS(L15)-ABS(M15)-(N15+N16)/2+10>0,IF(L15<0,-(ABS(L15)-ABS(M15)-(N15+N16)/2+10),L15-ABS(M15)-(N15+N16)/2+10),0)),0)","v":16},7,null,2.2000000000000002,{"$f":"IF(AND(R15>0,R16>0),IF(OR(R15>10,R15<0,R16>10,R16<0),\"Fehler\",IF(ABS(P15)-ABS(Q15)-(R15+R16)/2+10>0,IF(P15<0,-(ABS(P15)-ABS(Q15)-(R15+R16)/2+10),P15-ABS(Q15)-(R15+R16)/2+10),0)),0)","v":14.8},6,null,0.8,{"$f":"IF(AND(V15>0,V16>0),IF(OR(V15>10,V15<0,V16>10,V16<0),\"Fehler\",IF(ABS(T15)-ABS(U15)-(V15+V16)/2+10>0,IF(T15<0,-(ABS(T15)-ABS(U15)-(V15+V16)/2+10),T15-ABS(U15)-(V15+V16)/2+10),0)),0)","v":15.1},null,null,null,{"$f":"IF(AND(Z15>0,Z16>0),IF(OR(Z15>10,Z15<0,Z16>10,Z16<0),\"Fehler\",IF(ABS(X15)-ABS(Y15)-(Z15+Z16)/2+10>0,IF(X15<0,-(ABS(X15)-ABS(Y15)-(Z15+Z16)/2+10),X15-ABS(Y15)-(Z15+Z16)/2+10),0)),0)","v":0},{"$f":"ABS(G15)+ABS(K15)+ABS(O15)+ABS(S15)+ABS(W15)+ABS(AA15)","v":60.65},null,null,null,"Barren",{"$f":"IF(W30>1,1,0)","v":1}]
[null,null,null,null,null,null,null,null,null,2.2000000000000002,null,null,null,1.8,null,null,null,2.2000000000000002,null,null,null,1,null,null,null,null,null,null,null,null,null,"Reck",{"$f":"IF(AA30>1,1,0)","v":1}]
["Lu Rosebrock",{"$f":"IF(A17>0,B15,\"\")","v":"Einbecker SV 2"},{"$f":"IF(A17<>\"\", VLOOKUP(A17,'Wertungszettel M6'!A$7:B$36,2,0),\"\")","v":"06"},5,null,4.3,{"$f":"IF(AND(F17>0,F18>0),IF(OR(F17>10,F17<0,F18>10,F18<0),\"Fehler\",IF(ABS(D17)-ABS(E17)-(F17+F18)/2+10>0,IF(D17<0,-(ABS(D17)-ABS(E17)-(F17+F18)/2+10),D17-ABS(E17)-(F17+F18)/2+10),0)),0)","v":10.85},5,null,2.7,{"$f":"IF(AND(J17>0,J18>0),IF(OR(J17>10,J17<0,J18>10,J18<0),\"Fehler\",IF(ABS(H17)-ABS(I17)-(J17+J18)/2+10>0,IF(H17<0,-(ABS(H17)-ABS(I17)-(J17+J18)/2+10),H17-ABS(I17)-(J17+J18)/2+10),0)),0)","v":12.4},5,null,2.2000000000000002,{"$f":"IF(AND(N17>0,N18>0),IF(OR(N17>10,N17<0,N18>10,N18<0),\"Fehler\",IF(ABS(L17)-ABS(M17)-(N17+N18)/2+10>0,IF(L17<0,-(ABS(L17)-ABS(M17)-(N17+N18)/2+10),L17-ABS(M17)-(N17+N18)/2+10),0)),0)","v":12.6},5,null,1.3,{"$f":"IF(AND(R17>0,R18>0),IF(OR(R17>10,R17<0,R18>10,R18<0),\"Fehler\",IF(ABS(P17)-ABS(Q17)-(R17+R18)/2+10>0,IF(P17<0,-(ABS(P17)-ABS(Q17)-(R17+R18)/2+10),P17-ABS(Q17)-(R17+R18)/2+10),0)),0)","v":13.7},6,null,1.9,{"$f":"IF(AND(V17>0,V18>0),IF(OR(V17>10,V17<0,V18>10,V18<0),\"Fehler\",IF(ABS(T17)-ABS(U17)-(V17+V18)/2+10>0,IF(T17<0,-(ABS(T17)-ABS(U17)-(V17+V18)/2+10),T17-ABS(U17)-(V17+V18)/2+10),0)),0)","v":13.95},null,null,null,{"$f":"IF(AND(Z17>0,Z18>0),IF(OR(Z17>10,Z17<0,Z18>10,Z18<0),\"Fehler\",IF(ABS(X17)-ABS(Y17)-(Z17+Z18)/2+10>0,IF(X17<0,-(ABS(X17)-ABS(Y17)-(Z17+Z18)/2+10),X17-ABS(Y17)-(Z17+Z18)/2+10),0)),0)","v":0},{"$f":"ABS(G17)+ABS(K17)+ABS(O17)+ABS(S17)+ABS(W17)+ABS(AA17)","v":63.5}]
[null,null,null,null,null,4,null,null,null,2.5,null,null,null,2.6,null,null,null,1.3,null,null,null,2.2000000000000002,null,null,null,null,null,null,null,null,null,"Gesamt",{"$f":"SUM(AG11:AG17)","v":6}]
[null,{"$f":"IF(A19>0,B17,\"\")","v":""},{"$f":"IF(A19<>\"\", VLOOKUP(A19,'Wertungszettel M6'!A$7:B$36,2,0),\"\")","v":""},null,null,null,{"$f":"IF(AND(F19>0,F20>0),IF(OR(F19>10,F19<0,F20>10,F20<0),\"Fehler\",IF(ABS(D19)-ABS(E19)-(F19+F20)/2+10>0,IF(D19<0,-(ABS(D19)-ABS(E19)-(F19+F20)/2+10),D19-ABS(E19)-(F19+F20)/2+10),0)),0)","v":0},null,null,null,{"$f":"IF(AND(J19>0,J20>0),IF(OR(J19>10,J19<0,J20>10,J20<0),\"Fehler\",IF(ABS(H19)-ABS(I19)-(J19+J20)/2+10>0,IF(H19<0,-(ABS(H19)-ABS(I19)-(J19+J20)/2+10),H19-ABS(I19)-(J19+J20)/2+10),0)),0)","v":0},null,null,null,{"$f":"IF(AND(N19>0,N20>0),IF(OR(N19>10,N19<0,N20>10,N20<0),\"Fehler\",IF(ABS(L19)-ABS(M19)-(N19+N20)/2+10>0,IF(L19<0,-(ABS(L19)-ABS(M19)-(N19+N20)/2+10),L19-ABS(M19)-(N19+N20)/2+10),0)),0)","v":0},null,null,null,{"$f":"IF(AND(R19>0,R20>0),IF(OR(R19>10,R19<0,R20>10,R20<0),\"Fehler\",IF(ABS(P19)-ABS(Q19)-(R19+R20)/2+10>0,IF(P19<0,-(ABS(P19)-ABS(Q19)-(R19+R20)/2+10),P19-ABS(Q19)-(R19+R20)/2+10),0)),0)","v":0},null,null,null,{"$f":"IF(AND(V19>0,V20>0),IF(OR(V19>10,V19<0,V20>10,V20<0),\"Fehler\",IF(ABS(T19)-ABS(U19)-(V19+V20)/2+10>0,IF(T19<0,-(ABS(T19)-ABS(U19)-(V19+V20)/2+10),T19-ABS(U19)-(V19+V20)/2+10),0)),0)","v":0},null,null,null,{"$f":"IF(AND(Z19>0,Z20>0),IF(OR(Z19>10,Z19<0,Z20>10,Z20<0),\"Fehler\",IF(ABS(X19)-ABS(Y19)-(Z19+Z20)/2+10>0,IF(X19<0,-(ABS(X19)-ABS(Y19)-(Z19+Z20)/2+10),X19-ABS(Y19)-(Z19+Z20)/2+10),0)),0)","v":0},{"$f":"ABS(G19)+ABS(K19)+ABS(O19)+ABS(S19)+ABS(W19)+ABS(AA19)","v":0}]
[]
[null,{"$f":"IF(A21>0,B19,\"\")","v":""},{"$f":"IF(A21<>\"\", VLOOKUP(A21,'Wertungszettel M6'!A$7:B$36,2,0),\"\")","v":""},null,null,null,{"$f":"IF(AND(F21>0,F22>0),IF(OR(F21>10,F21<0,F22>10,F22<0),\"Fehler\",IF(ABS(D21)-ABS(E21)-(F21+F22)/2+10>0,IF(D21<0,-(ABS(D21)-ABS(E21)-(F21+F22)/2+10),D21-ABS(E21)-(F21+F22)/2+10),0)),0)","v":0},null,null,null,{"$f":"IF(AND(J21>0,J22>0),IF(OR(J21>10,J21<0,J22>10,J22<0),\"Fehler\",IF(ABS(H21)-ABS(I21)-(J21+J22)/2+10>0,IF(H21<0,-(ABS(H21)-ABS(I21)-(J21+J22)/2+10),H21-ABS(I21)-(J21+J22)/2+10),0)),0)","v":0},null,null,null,{"$f":"IF(AND(N21>0,N22>0),IF(OR(N21>10,N21<0,N22>10,N22<0),\"Fehler\",IF(ABS(L21)-ABS(M21)-(N21+N22)/2+10>0,IF(L21<0,-(ABS(L21)-ABS(M21)-(N21+N22)/2+10),L21-ABS(M21)-(N21+N22)/2+10),0)),0)","v":0},null,null,null,{"$f":"IF(AND(R21>0,R22>0),IF(OR(R21>10,R21<0,R22>10,R22<0),\"Fehler\",IF(ABS(P21)-ABS(Q21)-(R21+R22)/2+10>0,IF(P21<0,-(ABS(P21)-ABS(Q21)-(R21+R22)/2+10),P21-ABS(Q21)-(R21+R22)/2+10),0)),0)","v":0},null,null,null,{"$f":"IF(AND(V21>0,V22>0),IF(OR(V21>10,V21<0,V22>10,V22<0),\"Fehler\",IF(ABS(T21)-ABS(U21)-(V21+V22)/2+10>0,IF(T21<0,-(ABS(T21)-ABS(U21)-(V21+V22)/2+10),T21-ABS(U21)-(V21+V22)/2+10),0)),0)","v":0},null,null,null,{"$f":"IF(AND(Z21>0,Z22>0),IF(OR(Z21>10,Z21<0,Z22>10,Z22<0),\"Fehler\",IF(ABS(X21)-ABS(Y21)-(Z21+Z22)/2+10>0,IF(X21<0,-(ABS(X21)-ABS(Y21)-(Z21+Z22)/2+10),X21-ABS(Y21)-(Z21+Z22)/2+10),0)),0)","v":0},{"$f":"ABS(G21)+ABS(K21)+ABS(O21)+ABS(S21)+ABS(W21)+ABS(AA21)","v":0}]
[]
[null,{"$f":"IF(A23>0,B21,\"\")","v":""},{"$f":"IF(A23<>\"\", VLOOKUP(A23,'Wertungszettel M6'!A$7:B$36,2,0),\"\")","v":""},null,null,null,{"$f":"IF(AND(F23>0,F24>0),IF(OR(F23>10,F23<0,F24>10,F24<0),\"Fehler\",IF(ABS(D23)-ABS(E23)-(F23+F24)/2+10>0,IF(D23<0,-(ABS(D23)-ABS(E23)-(F23+F24)/2+10),D23-ABS(E23)-(F23+F24)/2+10),0)),0)","v":0},null,null,null,{"$f":"IF(AND(J23>0,J24>0),IF(OR(J23>10,J23<0,J24>10,J24<0),\"Fehler\",IF(ABS(H23)-ABS(I23)-(J23+J24)/2+10>0,IF(H23<0,-(ABS(H23)-ABS(I23)-(J23+J24)/2+10),H23-ABS(I23)-(J23+J24)/2+10),0)),0)","v":0},null,null,null,{"$f":"IF(AND(N23>0,N24>0),IF(OR(N23>10,N23<0,N24>10,N24<0),\"Fehler\",IF(ABS(L23)-ABS(M23)-(N23+N24)/2+10>0,IF(L23<0,-(ABS(L23)-ABS(M23)-(N23+N24)/2+10),L23-ABS(M23)-(N23+N24)/2+10),0)),0)","v":0},null,null,null,{"$f":"IF(AND(R23>0,R24>0),IF(OR(R23>10,R23<0,R24>10,R24<0),\"Fehler\",IF(ABS(P23)-ABS(Q23)-(R23+R24)/2+10>0,IF(P23<0,-(ABS(P23)-ABS(Q23)-(R23+R24)/2+10),P23-ABS(Q23)-(R23+R24)/2+10),0)),0)","v":0},null,null,null,{"$f":"IF(AND(V23>0,V24>0),IF(OR(V23>10,V23<0,V24>10,V24<0),\"Fehler\",IF(ABS(T23)-ABS(U23)-(V23+V24)/2+10>0,IF(T23<0,-(ABS(T23)-ABS(U23)-(V23+V24)/2+10),T23-ABS(U23)-(V23+V24)/2+10),0)),0)","v":0},null,null,null,{"$f":"IF(AND(Z23>0,Z24>0),IF(OR(Z23>10,Z23<0,Z24>10,Z24<0),\"Fehler\",IF(ABS(X23)-ABS(Y23)-(Z23+Z24)/2+10>0,IF(X23<0,-(ABS(X23)-ABS(Y23)-(Z23+Z24)/2+10),X23-ABS(Y23)-(Z23+Z24)/2+10),0)),0)","v":0},{"$f":"ABS(G23)+ABS(K23)+ABS(O23)+ABS(S23)+ABS(W23)+ABS(AA23)","v":0}]
[]
[null,{"$f":"IF(A25>0,B23,\"\")","v":""},{"$f":"IF(A25<>\"\", VLOOKUP(A25,'Wertungszettel M6'!A$7:B$36,2,0),\"\")","v":""},null,null,null,{"$f":"IF(AND(F25>0,F26>0),IF(OR(F25>10,F25<0,F26>10,F26<0),\"Fehler\",IF(ABS(D25)-ABS(E25)-(F25+F26)/2+10>0,IF(D25<0,-(ABS(D25)-ABS(E25)-(F25+F26)/2+10),D25-ABS(E25)-(F25+F26)/2+10),0)),0)","v":0},null,null,null,{"$f":"IF(AND(J25>0,J26>0),IF(OR(J25>10,J25<0,J26>10,J26<0),\"Fehler\",IF(ABS(H25)-ABS(I25)-(J25+J26)/2+10>0,IF(H25<0,-(ABS(H25)-ABS(I25)-(J25+J26)/2+10),H25-ABS(I25)-(J25+J26)/2+10),0)),0)","v":0},null,null,null,{"$f":"IF(AND(N25>0,N26>0),IF(OR(N25>10,N25<0,N26>10,N26<0),\"Fehler\",IF(ABS(L25)-ABS(M25)-(N25+N26)/2+10>0,IF(L25<0,-(ABS(L25)-ABS(M25)-(N25+N26)/2+10),L25-ABS(M25)-(N25+N26)/2+10),0)),0)","v":0},null,null,null,{"$f":"IF(AND(R25>0,R26>0),IF(OR(R25>10,R25<0,R26>10,R26<0),\"Fehler\",IF(ABS(P25)-ABS(Q25)-(R25+R26)/2+10>0,IF(P25<0,-(ABS(P25)-ABS(Q25)-(R25+R26)/2+10),P25-ABS(Q25)-(R25+R26)/2+10),0)),0)","v":0},null,null,null,{"$f":"IF(AND(V25>0,V26>0),IF(OR(V25>10,V25<0,V26>10,V26<0),\"Fehler\",IF(ABS(T25)-ABS(U25)-(V25+V26)/2+10>0,IF(T25<0,-(ABS(T25)-ABS(U25)-(V25+V26)/2+10),T25-ABS(U25)-(V25+V26)/2+10),0)),0)","v":0},null,null,null,{"$f":"IF(AND(Z25>0,Z26>0),IF(OR(Z25>10,Z25<0,Z26>10,Z26<0),\"Fehler\",IF(ABS(X25)-ABS(Y25)-(Z25+Z26)/2+10>0,IF(X25<0,-(ABS(X25)-ABS(Y25)-(Z25+Z26)/2+10),X25-ABS(Y25)-(Z25+Z26)/2+10),0)),0)","v":0},{"$f":"ABS(G25)+ABS(K25)+ABS(O25)+ABS(S25)+ABS(W25)+ABS(AA25)","v":0}]
[]
[null,{"$f":"IF(A27>0,B25,\"\")","v":""},{"$f":"IF(A27<>\"\", VLOOKUP(A27,'Wertungszettel M6'!A$7:B$36,2,0),\"\")","v":""},null,null,null,{"$f":"IF(AND(F27>0,F28>0),IF(OR(F27>10,F27<0,F28>10,F28<0),\"Fehler\",IF(ABS(D27)-ABS(E27)-(F27+F28)/2+10>0,IF(D27<0,-(ABS(D27)-ABS(E27)-(F27+F28)/2+10),D27-ABS(E27)-(F27+F28)/2+10),0)),0)","v":0},null,null,null,{"$f":"IF(AND(J27>0,J28>0),IF(OR(J27>10,J27<0,J28>10,J28<0),\"Fehler\",IF(ABS(H27)-ABS(I27)-(J27+J28)/2+10>0,IF(H27<0,-(ABS(H27)-ABS(I27)-(J27+J28)/2+10),H27-ABS(I27)-(J27+J28)/2+10),0)),0)","v":0},null,null,null,{"$f":"IF(AND(N27>0,N28>0),IF(OR(N27>10,N27<0,N28>10,N28<0),\"Fehler\",IF(ABS(L27)-ABS(M27)-(N27+N28)/2+10>0,IF(L27<0,-(ABS(L27)-ABS(M27)-(N27+N28)/2+10),L27-ABS(M27)-(N27+N28)/2+10),0)),0)","v":0},null,null,null,{"$f":"IF(AND(R27>0,R28>0),IF(OR(R27>10,R27<0,R28>10,R28<0),\"Fehler\",IF(ABS(P27)-ABS(Q27)-(R27+R28)/2+10>0,IF(P27<0,-(ABS(P27)-ABS(Q27)-(R27+R28)/2+10),P27-ABS(Q27)-(R27+R28)/2+10),0)),0)","v":0},null,null,null,{"$f":"IF(AND(V27>0,V28>0),IF(OR(V27>10,V27<0,V28>10,V28<0),\"Fehler\",IF(ABS(T27)-ABS(U27)-(V27+V28)/2+10>0,IF(T27<0,-(ABS(T27)-ABS(U27)-(V27+V28)/2+10),T27-ABS(U27)-(V27+V28)/2+10),0)),0)","v":0},null,null,null,{"$f":"IF(AND(Z27>0,Z28>0),IF(OR(Z27>10,Z27<0,Z28>10,Z28<0),\"Fehler\",IF(ABS(X27)-ABS(Y27)-(Z27+Z28)/2+10>0,IF(X27<0,-(ABS(X27)-ABS(Y27)-(Z27+Z28)/2+10),X27-ABS(Y27)-(Z27+Z28)/2+10),0)),0)","v":0},{"$f":"ABS(G27)+ABS(K27)+ABS(O27)+ABS(S27)+ABS(W27)+ABS(AA27)","v":0}]
[]
[]
[null,null,null,null,null,null,{"$f":"SUM(LARGE(G9:G28,1),LARGE(G9:G28,2),LARGE(G9:G28,3))","v":47.349999999999994},null,null,null,{"$f":"SUM(LARGE(K9:K28,1),LARGE(K9:K28,2),LARGE(K9:K28,3))","v":43.1},null,null,null,{"$f":"SUM(LARGE(O9:O28,1),LARGE(O9:O28,2),LARGE(O9:O28,3))","v":46.2},null,null,null,{"$f":"SUM(LARGE(S9:S28,1),LARGE(S9:S28,2),LARGE(S9:S28,3))","v":44.9},null,null,null,{"$f":"SUM(LARGE(W9:W28,1),LARGE(W9:W28,2),LARGE(W9:W28,3))","v":44.1},null,null,null,{"$f":"SUM(LARGE(AA9:AA28,1),LARGE(AA9:AA28,2),LARGE(AA9:AA28,3))","v":42.9},{"$f":"SUM(G30,K30,O30,S30,W30,AA30)","v":268.54999999999995}]

{"sheet":"TG Hehlen Dielmissen","index":10,"n_rows":30,"n_cols":33,"rows_kept":30,"cut":false,"hidden":false,"merged":[[26,27,27,27],[26,16,27,16],[26,18,27,18],[26,19,27,19],[26,20,27,20],[26,22,27,22],[26,23,27,23],[26,8,27,8],[26,10,27,10],[26,11,27,11],[26,12,27,12],[26,14,27,14],[26,15,27,15],[24,24,25,24],[24,26,25,26],[24,27,25,27],[26,0,27,0],[26,1,27,1],[26,2,27,2],[26,3,27,3],[26,4,27,4],[26,6,27,6],[26,7,27,7],[24,16,25,16],[24,18,25,18],[24,19,25,19],[24,20,25,20],[24,22,25,22],[24,23,25,23],[24,8,25,8],[24,10,25,10],[24,11,25,11],[24,12,25,12],[24,14,25,14],[24,15,25,15],[26,24,27,24],[26,26,27,26],[22,20,23,20],[22,22,23,22],[22,23,23,23],[22,8,23,8],[22,10,23,10],[22,11,23,11],[22,12,23,12],[22,14,23,14],[22,15,23,15],[24,0,25,0],[24,1,25,1],[24,2,25,2],[24,3,25,3],[24,4,25,4],[24,6,25,6],[24,7,25,7],[22,16,23,16],[22,18,23,18],[20,27,21,27],[22,0,23,0],[22,1,23,1],[22,2,23,2],[22,3,23,3],[22,4,23,4],[22,6,23,6],[22,7,23,7],[20,16,21,16],[20,18,21,18],[20,19,21,19],[20,20,21,20],[20,22,21,22],[20,23,21,23],[20,8,21,8],[20,10,21,10],[20,11,21,11],[20,12,21,12],[20,14,21,14],[20,15,21,15],[22,24,23,24],[22,26,23,26],[22,27,23,27],[22,19,23,19],[18,24,19,24],[18,26,19,26],[18,27,19,27],[20,0,21,0],[20,1,21,1],[20,2,21,2],[20,3,21,3],[20,4,21,4],[20,6,21,6],[20,7,21,7],[18,16,19,16],[18,18,19,18],[18,19,19,19],[18,20,19,20],[18,22,19,22],[18,23,19,23],[18,8,19,8],[18,10,19,10],[18,11,19,11],[18,12,19,12],[18,14,19,14],[18,15,19,15],[20,24,21,24],[20,26,21,26],[16,20,17,20],[16,22,17,22],[16,23,17,23],[16,8,17,8],[16,10,17,10],[16,11,17,11],[16,12,17,12],[16,14,17,14],[16,15,17,15],[18,0,19,0],[18,1,19,1],[18,2,19,2],[18,3,19,3],[18,4,19,4],[18,6,19,6],[18,7,19,7],[16,16,17,16],[16,18,17,18],[14,27,15,27],[16,0,17,0],[16,1,17,1],[16,2,17,2],[16,3,17,3],[16,4,17,4],[16,6,17,6],[16,7,17,7],[14,16,15,16],[14,18,15,18],[14,19,15,19],[14,20,15,20],[14,22,15,22],[14,23,15,23],[14,8,15,8],[14,10,15,10],[14,11,15,11],[14,12,15,12],[14,14,15,14],[14,15,15,15],[16,24,17,24],[16,26,17,26],[16,27,17,27],[16,19,17,19],[12,24,13,24],[12,26,13,26],[12,27,13,27],[14,0,15,0],[14,1,15,1],[14,2,15,2],[14,3,15,3],[14,4,15,4],[14,6,15,6],[14,7,15,7],[12,16,13,16],[12,18,13,18],[12,19,13,19],[12,20,13,20],[12,22,13,22],[12,23,13,23],[12,8,13,8],[12,10,13,10],[12,11,13,11],[12,12,13,12],[12,14,13,14],[12,15,13,15],[14,24,15,24],[14,26,15,26],[10,19,11,19],[10,20,11,20],[10,22,11,22],[10,7,11,7],[10,8,11,8],[10,10,11,10],[10,11,11,11],[10,12,11,12],[10,14,11,14],[12,0,13,0],[12,1,13,1],[12,2,13,2],[12,3,13,3],[12,4,13,4],[12,6,13,6],[12,7,13,7],[10,16,11,16],[10,18,11,18],[10,15,11,15],[8,27,9,27],[10,0,11,0],[10,1,11,1],[10,2,11,2],[10,3,11,3],[10,4,11,4],[10,6,11,6],[8,15,9,15],[8,16,9,16],[8,18,9,18],[8,19,9,19],[8,20,9,20],[10,23,11,23],[8,7,9,7],[8,8,9,8],[8,10,9,10],[8,11,9,11],[8,12,9,12],[8,14,9,14],[8,0,9,0],[8,1,9,1],[10,24,11,24],[10,26,11,26],[10,27,11,27],[6,23,6,26],[0,12,0,13],[2,0,2,1],[2,5,2,7],[2,12,2,13],[8,2,9,2],[8,3,9,3],[8,4,9,4],[8,6,9,6],[6,3,6,6],[6,7,6,10],[6,11,6,14],[6,15,6,18],[6,19,6,22],[8,23,9,23],[8,24,9,24],[8,26,9,26],[8,22,9,22],[2,14,2,16],[0,14,0,16],[4,14,4,16]]}
["Wettkampfbogen",null,null,null,null,null,null,null,null,null,null,null,"Datum:",null,{"$f":"'INFO Blatt'!B13","v":"2018-03-03"}]
[]
[null,null,null,null,null,null,null,null,null,null,null,null,"Ort:",null,{"$f":"'INFO Blatt'!B11","v":"Hehlen"}]
[]
[null,null,null,null,null,null,null,null,null,null,null,null,null,"Liga:",{"$f":"'INFO Blatt'!B7","v":"Schülerliga Süd"}]
[]
["Name","Verein","Jg","Boden",null,null,null,"Pferd",null,null,null,"Ringe",null,null,null,"Sprung",null,null,null,"Barren",null,null,null,"Reck",null,null,null,"Ges."]
[null,null,null,"D-Note","Abzug OK","E- Abzug","Note","D-Note","Abzug OK","E- Abzug","Note","D-Note","Abzug OK","E-Abzug","Note","D-Note","Abzug OK","E-Abzug","Note","D-Note","Abzug OK","E-Abzug","Note","D-Note","Abzug OK","E-Abzug","Note"]
["Viktor Brauer",{"$f":"Formeln!A11","v":"TG Hehlen Dielmissen"},{"$f":"IF(A9<>\"\", VLOOKUP(A9,'Wertungszettel M7'!A$7:B$36,2,0),\"\")","v":"07"},5,null,1.2,{"$f":"IF(AND(F9>0,F10>0),IF(OR(F9>10,F9<0,F10>10,F10<0),\"Fehler\",IF(ABS(D9)-ABS(E9)-(F9+F10)/2+10>0,IF(D9<0,-(ABS(D9)-ABS(E9)-(F9+F10)/2+10),D9-ABS(E9)-(F9+F10)/2+10),0)),0)","v":13.8},5,null,2.9,{"$f":"IF(AND(J9>0,J10>0),IF(OR(J9>10,J9<0,J10>10,J10<0),\"Fehler\",IF(ABS(H9)-ABS(I9)-(J9+J10)/2+10>0,IF(H9<0,-(ABS(H9)-ABS(I9)-(J9+J10)/2+10),H9-ABS(I9)-(J9+J10)/2+10),0)),0)","v":12.1},5,null,2.1,{"$f":"IF(AND(N9>0,N10>0),IF(OR(N9>10,N9<0,N10>10,N10<0),\"Fehler\",IF(ABS(L9)-ABS(M9)-(N9+N10)/2+10>0,IF(L9<0,-(ABS(L9)-ABS(M9)-(N9+N10)/2+10),L9-ABS(M9)-(N9+N10)/2+10),0)),0)","v":13},5,null,1,{"$f":"IF(AND(R9>0,R10>0),IF(OR(R9>10,R9<0,R10>10,R10<0),\"Fehler\",IF(ABS(P9)-ABS(Q9)-(R9+R10)/2+10>0,IF(P9<0,-(ABS(P9)-ABS(Q9)-(R9+R10)/2+10),P9-ABS(Q9)-(R9+R10)/2+10),0)),0)","v":14},5,null,3.8,{"$f":"IF(AND(V9>0,V10>0),IF(OR(V9>10,V9<0,V10>10,V10<0),\"Fehler\",IF(ABS(T9)-ABS(U9)-(V9+V10)/2+10>0,IF(T9<0,-(ABS(T9)-ABS(U9)-(V9+V10)/2+10),T9-ABS(U9)-(V9+V10)/2+10),0)),0)","v":11.1},5,null,2.6,{"$f":"IF(AND(Z9>0,Z10>0),IF(OR(Z9>10,Z9<0,Z10>10,Z10<0),\"Fehler\",IF(ABS(X9)-ABS(Y9)-(Z9+Z10)/2+10>0,IF(X9<0,-(ABS(X9)-ABS(Y9)-(Z9+Z10)/2+10),X9-ABS(Y9)-(Z9+Z10)/2+10),0)),0)","v":12.25},{"$f":"ABS(G9)+ABS(K9)+ABS(O9)+ABS(S9)+ABS(W9)+ABS(AA9)","v":76.25}]
[null,null,null,null,null,1.2,null,null,null,2.9,null,null,null,1.9,null,null,null,1,null,null,null,4,null,null,null,2.9]
["Norwin Eilers",{"$f":"IF(A11>0,B9,\"\")","v":"TG Hehlen Dielmissen"},{"$f":"IF(A11<>\"\", VLOOKUP(A11,'Wertungszettel M7'!A$7:B$36,2,0),\"\")","v":"07"},5,null,1.8,{"$f":"IF(AND(F11>0,F12>0),IF(OR(F11>10,F11<0,F12>10,F12<0),\"Fehler\",IF(ABS(D11)-ABS(E11)-(F11+F12)/2+10>0,IF(D11<0,-(ABS(D11)-ABS(E11)-(F11+F12)/2+10),D11-ABS(E11)-(F11+F12)/2+10),0)),0)","v":13.1},5,null,3.4,{"$f":"IF(AND(J11>0,J12>0),IF(OR(J11>10,J11<0,J12>10,J12<0),\"Fehler\",IF(ABS(H11)-ABS(I11)-(J11+J12)/2+10>0,IF(H11<0,-(ABS(H11)-ABS(I11)-(J11+J12)/2+10),H11-ABS(I11)-(J11+J12)/2+10),0)),0)","v":11.8},6,0.5,2.6,{"$f":"IF(AND(N11>0,N12>0),IF(OR(N11>10,N11<0,N12>10,N12<0),\"Fehler\",IF(ABS(L11)-ABS(M11)-(N11+N12)/2+10>0,IF(L11<0,-(ABS(L11)-ABS(M11)-(N11+N12)/2+10),L11-ABS(M11)-(N11+N12)/2+10),0)),0)","v":12.9},5,null,1.2,{"$f":"IF(AND(R11>0,R12>0),IF(OR(R11>10,R11<0,R12>10,R12<0),\"Fehler\",IF(ABS(P11)-ABS(Q11)-(R11+R12)/2+10>0,IF(P11<0,-(ABS(P11)-ABS(Q11)-(R11+R12)/2+10),P11-ABS(Q11)-(R11+R12)/2+10),0)),0)","v":13.8},5,null,4.0999999999999996,{"$f":"IF(AND(V11>0,V12>0),IF(OR(V11>10,V11<0,V12>10,V12<0),\"Fehler\",IF(ABS(T11)-ABS(U11)-(V11+V12)/2+10>0,IF(T11<0,-(ABS(T11)-ABS(U11)-(V11+V12)/2+10),T11-ABS(U11)-(V11+V12)/2+10),0)),0)","v":11.1},5,null,2.4,{"$f":"IF(AND(Z11>0,Z12>0),IF(OR(Z11>10,Z11<0,Z12>10,Z12<0),\"Fehler\",IF(ABS(X11)-ABS(Y11)-(Z11+Z12)/2+10>0,IF(X11<0,-(ABS(X11)-ABS(Y11)-(Z11+Z12)/2+10),X11-ABS(Y11)-(Z11+Z12)/2+10),0)),0)","v":12.6},{"$f":"ABS(G11)+ABS(K11)+ABS(O11)+ABS(S11)+ABS(W11)+ABS(AA11)","v":75.3},null,null,null,"Boden",{"$f":"IF(G30>1,1,0)","v":1}]
[null,null,null,null,null,2,null,null,null,3,null,null,null,2.6,null,null,null,1.2,null,null,null,3.7,null,null,null,2.4,null,null,null,null,null,"pauschenpferd",{"$f":"IF(K30>1,1,0)","v":1}]
["Thore Gruppe",{"$f":"IF(A13>0,B11,\"\")","v":"TG Hehlen Dielmissen"},{"$f":"IF(A13<>\"\", VLOOKUP(A13,'Wertungszettel M7'!A$7:B$36,2,0),\"\")","v":"07"},5,null,2.7,{"$f":"IF(AND(F13>0,F14>0),IF(OR(F13>10,F13<0,F14>10,F14<0),\"Fehler\",IF(ABS(D13)-ABS(E13)-(F13+F14)/2+10>0,IF(D13<0,-(ABS(D13)-ABS(E13)-(F13+F14)/2+10),D13-ABS(E13)-(F13+F14)/2+10),0)),0)","v":12.4},5,null,4.2,{"$f":"IF(AND(J13>0,J14>0),IF(OR(J13>10,J13<0,J14>10,J14<0),\"Fehler\",IF(ABS(H13)-ABS(I13)-(J13+J14)/2+10>0,IF(H13<0,-(ABS(H13)-ABS(I13)-(J13+J14)/2+10),H13-ABS(I13)-(J13+J14)/2+10),0)),0)","v":10.8},5,0.5,2.2999999999999998,{"$f":"IF(AND(N13>0,N14>0),IF(OR(N13>10,N13<0,N14>10,N14<0),\"Fehler\",IF(ABS(L13)-ABS(M13)-(N13+N14)/2+10>0,IF(L13<0,-(ABS(L13)-ABS(M13)-(N13+N14)/2+10),L13-ABS(M13)-(N13+N14)/2+10),0)),0)","v":12.2},5,null,1.4,{"$f":"IF(AND(R13>0,R14>0),IF(OR(R13>10,R13<0,R14>10,R14<0),\"Fehler\",IF(ABS(P13)-ABS(Q13)-(R13+R14)/2+10>0,IF(P13<0,-(ABS(P13)-ABS(Q13)-(R13+R14)/2+10),P13-ABS(Q13)-(R13+R14)/2+10),0)),0)","v":13.6},5,null,4,{"$f":"IF(AND(V13>0,V14>0),IF(OR(V13>10,V13<0,V14>10,V14<0),\"Fehler\",IF(ABS(T13)-ABS(U13)-(V13+V14)/2+10>0,IF(T13<0,-(ABS(T13)-ABS(U13)-(V13+V14)/2+10),T13-ABS(U13)-(V13+V14)/2+10),0)),0)","v":11.25},5,null,2.1,{"$f":"IF(AND(Z13>0,Z14>0),IF(OR(Z13>10,Z13<0,Z14>10,Z14<0),\"Fehler\",IF(ABS(X13)-ABS(Y13)-(Z13+Z14)/2+10>0,IF(X13<0,-(ABS(X13)-ABS(Y13)-(Z13+Z14)/2+10),X13-ABS(Y13)-(Z13+Z14)/2+10),0)),0)","v":12.7},{"$f":"ABS(G13)+ABS(K13)+ABS(O13)+ABS(S13)+ABS(W13)+ABS(AA13)","v":72.95},null,null,null,"ringe",{"$f":"IF(O30>1,1,0)","v":1}]
[null,null,null,null,null,2.5,null,null,null,4.2,null,null,null,2.2999999999999998,null,null,null,1.4,null,null,null,3.5,null,null,null,2.5,null,null,null,null,null,"sprung",{"$f":"IF(S30>1,1,0)","v":1}]
["Jakob Kammel",{"$f":"IF(A15>0,B13,\"\")","v":"TG Hehlen Dielmissen"},{"$f":"IF(A15<>\"\", VLOOKUP(A15,'Wertungszettel M7'!A$7:B$36,2,0),\"\")","v":"07"},null,null,null,{"$f":"IF(AND(F15>0,F16>0),IF(OR(F15>10,F15<0,F16>10,F16<0),\"Fehler\",IF(ABS(D15)-ABS(E15)-(F15+F16)/2+10>0,IF(D15<0,-(ABS(D15)-ABS(E15)-(F15+F16)/2+10),D15-ABS(E15)-(F15+F16)/2+10),0)),0)","v":0},null,null,null,{"$f":"IF(AND(J15>0,J16>0),IF(OR(J15>10,J15<0,J16>10,J16<0),\"Fehler\",IF(ABS(H15)-ABS(I15)-(J15+J16)/2+10>0,IF(H15<0,-(ABS(H15)-ABS(I15)-(J15+J16)/2+10),H15-ABS(I15)-(J15+J16)/2+10),0)),0)","v":0},null,null,null,{"$f":"IF(AND(N15>0,N16>0),IF(OR(N15>10,N15<0,N16>10,N16<0),\"Fehler\",IF(ABS(L15)-ABS(M15)-(N15+N16)/2+10>0,IF(L15<0,-(ABS(L15)-ABS(M15)-(N15+N16)/2+10),L15-ABS(M15)-(N15+N16)/2+10),0)),0)","v":0},null,null,null,{"$f":"IF(AND(R15>0,R16>0),IF(OR(R15>10,R15<0,R16>10,R16<0),\"Fehler\",IF(ABS(P15)-ABS(Q15)-(R15+R16)/2+10>0,IF(P15<0,-(ABS(P15)-ABS(Q15)-(R15+R16)/2+10),P15-ABS(Q15)-(R15+R16)/2+10),0)),0)","v":0},null,null,null,{"$f":"IF(AND(V15>0,V16>0),IF(OR(V15>10,V15<0,V16>10,V16<0),\"Fehler\",IF(ABS(T15)-ABS(U15)-(V15+V16)/2+10>0,IF(T15<0,-(ABS(T15)-ABS(U15)-(V15+V16)/2+10),T15-ABS(U15)-(V15+V16)/2+10),0)),0)","v":0},null,null,null,{"$f":"IF(AND(Z15>0,Z16>0),IF(OR(Z15>10,Z15<0,Z16>10,Z16<0),\"Fehler\",IF(ABS(X15)-ABS(Y15)-(Z15+Z16)/2+10>0,IF(X15<0,-(ABS(X15)-ABS(Y15)-(Z15+Z16)/2+10),X15-ABS(Y15)-(Z15+Z16)/2+10),0)),0)","v":0},{"$f":"ABS(G15)+ABS(K15)+ABS(O15)+ABS(S15)+ABS(W15)+ABS(AA15)","v":0},null,null,null,"Barren",{"$f":"IF(W30>1,1,0)","v":1}]
[null,null,null,null,null,null,null,null,null,null,null,null,null,null,null,null,null,null,null,null,null,null,null,null,null,null,null,null,null,null,null,"Reck",{"$f":"IF(AA30>1,1,0)","v":1}]
["Luca Puls",{"$f":"IF(A17>0,B15,\"\")","v":"TG Hehlen Dielmissen"},{"$f":"IF(A17<>\"\", VLOOKUP(A17,'Wertungszettel M7'!A$7:B$36,2,0),\"\")","v":"07"},null,null,null,{"$f":"IF(AND(F17>0,F18>0),IF(OR(F17>10,F17<0,F18>10,F18<0),\"Fehler\",IF(ABS(D17)-ABS(E17)-(F17+F18)/2+10>0,IF(D17<0,-(ABS(D17)-ABS(E17)-(F17+F18)/2+10),D17-ABS(E17)-(F17+F18)/2+10),0)),0)","v":0},null,null,null,{"$f":"IF(AND(J17>0,J18>0),IF(OR(J17>10,J17<0,J18>10,J18<0),\"Fehler\",IF(ABS(H17)-ABS(I17)-(J17+J18)/2+10>0,IF(H17<0,-(ABS(H17)-ABS(I17)-(J17+J18)/2+10),H17-ABS(I17)-(J17+J18)/2+10),0)),0)","v":0},null,null,null,{"$f":"IF(AND(N17>0,N18>0),IF(OR(N17>10,N17<0,N18>10,N18<0),\"Fehler\",IF(ABS(L17)-ABS(M17)-(N17+N18)/2+10>0,IF(L17<0,-(ABS(L17)-ABS(M17)-(N17+N18)/2+10),L17-ABS(M17)-(N17+N18)/2+10),0)),0)","v":0},null,null,null,{"$f":"IF(AND(R17>0,R18>0),IF(OR(R17>10,R17<0,R18>10,R18<0),\"Fehler\",IF(ABS(P17)-ABS(Q17)-(R17+R18)/2+10>0,IF(P17<0,-(ABS(P17)-ABS(Q17)-(R17+R18)/2+10),P17-ABS(Q17)-(R17+R18)/2+10),0)),0)","v":0},null,null,null,{"$f":"IF(AND(V17>0,V18>0),IF(OR(V17>10,V17<0,V18>10,V18<0),\"Fehler\",IF(ABS(T17)-ABS(U17)-(V17+V18)/2+10>0,IF(T17<0,-(ABS(T17)-ABS(U17)-(V17+V18)/2+10),T17-ABS(U17)-(V17+V18)/2+10),0)),0)","v":0},null,null,null,{"$f":"IF(AND(Z17>0,Z18>0),IF(OR(Z17>10,Z17<0,Z18>10,Z18<0),\"Fehler\",IF(ABS(X17)-ABS(Y17)-(Z17+Z18)/2+10>0,IF(X17<0,-(ABS(X17)-ABS(Y17)-(Z17+Z18)/2+10),X17-ABS(Y17)-(Z17+Z18)/2+10),0)),0)","v":0},{"$f":"ABS(G17)+ABS(K17)+ABS(O17)+ABS(S17)+ABS(W17)+ABS(AA17)","v":0}]
[null,null,null,null,null,null,null,null,null,null,null,null,null,null,null,null,null,null,null,null,null,null,null,null,null,null,null,null,null,null,null,"Gesamt",{"$f":"SUM(AG11:AG17)","v":6}]
["Yvo Vehling",{"$f":"IF(A19>0,B17,\"\")","v":"TG Hehlen Dielmissen"},{"$f":"IF(A19<>\"\", VLOOKUP(A19,'Wertungszettel M7'!A$7:B$36,2,0),\"\")","v":"07"},5,null,0.7,{"$f":"IF(AND(F19>0,F20>0),IF(OR(F19>10,F19<0,F20>10,F20<0),\"Fehler\",IF(ABS(D19)-ABS(E19)-(F19+F20)/2+10>0,IF(D19<0,-(ABS(D19)-ABS(E19)-(F19+F20)/2+10),D19-ABS(E19)-(F19+F20)/2+10),0)),0)","v":14.2},5,null,2.5,{"$f":"IF(AND(J19>0,J20>0),IF(OR(J19>10,J19<0,J20>10,J20<0),\"Fehler\",IF(ABS(H19)-ABS(I19)-(J19+J20)/2+10>0,IF(H19<0,-(ABS(H19)-ABS(I19)-(J19+J20)/2+10),H19-ABS(I19)-(J19+J20)/2+10),0)),0)","v":12.5},5,0.5,2.6,{"$f":"IF(AND(N19>0,N20>0),IF(OR(N19>10,N19<0,N20>10,N20<0),\"Fehler\",IF(ABS(L19)-ABS(M19)-(N19+N20)/2+10>0,IF(L19<0,-(ABS(L19)-ABS(M19)-(N19+N20)/2+10),L19-ABS(M19)-(N19+N20)/2+10),0)),0)","v":12},5,null,1,{"$f":"IF(AND(R19>0,R20>0),IF(OR(R19>10,R19<0,R20>10,R20<0),\"Fehler\",IF(ABS(P19)-ABS(Q19)-(R19+R20)/2+10>0,IF(P19<0,-(ABS(P19)-ABS(Q19)-(R19+R20)/2+10),P19-ABS(Q19)-(R19+R20)/2+10),0)),0)","v":13.95},5,null,3.8,{"$f":"IF(AND(V19>0,V20>0),IF(OR(V19>10,V19<0,V20>10,V20<0),\"Fehler\",IF(ABS(T19)-ABS(U19)-(V19+V20)/2+10>0,IF(T19<0,-(ABS(T19)-ABS(U19)-(V19+V20)/2+10),T19-ABS(U19)-(V19+V20)/2+10),0)),0)","v":11.35},5,null,2.8,{"$f":"IF(AND(Z19>0,Z20>0),IF(OR(Z19>10,Z19<0,Z20>10,Z20<0),\"Fehler\",IF(ABS(X19)-ABS(Y19)-(Z19+Z20)/2+10>0,IF(X19<0,-(ABS(X19)-ABS(Y19)-(Z19+Z20)/2+10),X19-ABS(Y19)-(Z19+Z20)/2+10),0)),0)","v":12.15},{"$f":"ABS(G19)+ABS(K19)+ABS(O19)+ABS(S19)+ABS(W19)+ABS(AA19)","v":76.150000000000006}]
[null,null,null,null,null,0.9,null,null,null,2.5,null,null,null,2.4,null,null,null,1.1000000000000001,null,null,null,3.5,null,null,null,2.9]
["Timm Zuchold",{"$f":"IF(A21>0,B19,\"\")","v":"TG Hehlen Dielmissen"},{"$f":"IF(A21<>\"\", VLOOKUP(A21,'Wertungszettel M7'!A$7:B$36,2,0),\"\")","v":"07"},null,null,null,{"$f":"IF(AND(F21>0,F22>0),IF(OR(F21>10,F21<0,F22>10,F22<0),\"Fehler\",IF(ABS(D21)-ABS(E21)-(F21+F22)/2+10>0,IF(D21<0,-(ABS(D21)-ABS(E21)-(F21+F22)/2+10),D21-ABS(E21)-(F21+F22)/2+10),0)),0)","v":0},null,null,null,{"$f":"IF(AND(J21>0,J22>0),IF(OR(J21>10,J21<0,J22>10,J22<0),\"Fehler\",IF(ABS(H21)-ABS(I21)-(J21+J22)/2+10>0,IF(H21<0,-(ABS(H21)-ABS(I21)-(J21+J22)/2+10),H21-ABS(I21)-(J21+J22)/2+10),0)),0)","v":0},null,null,null,{"$f":"IF(AND(N21>0,N22>0),IF(OR(N21>10,N21<0,N22>10,N22<0),\"Fehler\",IF(ABS(L21)-ABS(M21)-(N21+N22)/2+10>0,IF(L21<0,-(ABS(L21)-ABS(M21)-(N21+N22)/2+10),L21-ABS(M21)-(N21+N22)/2+10),0)),0)","v":0},null,null,null,{"$f":"IF(AND(R21>0,R22>0),IF(OR(R21>10,R21<0,R22>10,R22<0),\"Fehler\",IF(ABS(P21)-ABS(Q21)-(R21+R22)/2+10>0,IF(P21<0,-(ABS(P21)-ABS(Q21)-(R21+R22)/2+10),P21-ABS(Q21)-(R21+R22)/2+10),0)),0)","v":0},null,null,null,{"$f":"IF(AND(V21>0,V22>0),IF(OR(V21>10,V21<0,V22>10,V22<0),\"Fehler\",IF(ABS(T21)-ABS(U21)-(V21+V22)/2+10>0,IF(T21<0,-(ABS(T21)-ABS(U21)-(V21+V22)/2+10),T21-ABS(U21)-(V21+V22)/2+10),0)),0)","v":0},null,null,null,{"$f":"IF(AND(Z21>0,Z22>0),IF(OR(Z21>10,Z21<0,Z22>10,Z22<0),\"Fehler\",IF(ABS(X21)-ABS(Y21)-(Z21+Z22)/2+10>0,IF(X21<0,-(ABS(X21)-ABS(Y21)-(Z21+Z22)/2+10),X21-ABS(Y21)-(Z21+Z22)/2+10),0)),0)","v":0},{"$f":"ABS(G21)+ABS(K21)+ABS(O21)+ABS(S21)+ABS(W21)+ABS(AA21)","v":0}]
[]
[null,{"$f":"IF(A23>0,B21,\"\")","v":""},{"$f":"IF(A23<>\"\", VLOOKUP(A23,'Wertungszettel M7'!A$7:B$36,2,0),\"\")","v":""},null,null,null,{"$f":"IF(AND(F23>0,F24>0),IF(OR(F23>10,F23<0,F24>10,F24<0),\"Fehler\",IF(ABS(D23)-ABS(E23)-(F23+F24)/2+10>0,IF(D23<0,-(ABS(D23)-ABS(E23)-(F23+F24)/2+10),D23-ABS(E23)-(F23+F24)/2+10),0)),0)","v":0},null,null,null,{"$f":"IF(AND(J23>0,J24>0),IF(OR(J23>10,J23<0,J24>10,J24<0),\"Fehler\",IF(ABS(H23)-ABS(I23)-(J23+J24)/2+10>0,IF(H23<0,-(ABS(H23)-ABS(I23)-(J23+J24)/2+10),H23-ABS(I23)-(J23+J24)/2+10),0)),0)","v":0},null,null,null,{"$f":"IF(AND(N23>0,N24>0),IF(OR(N23>10,N23<0,N24>10,N24<0),\"Fehler\",IF(ABS(L23)-ABS(M23)-(N23+N24)/2+10>0,IF(L23<0,-(ABS(L23)-ABS(M23)-(N23+N24)/2+10),L23-ABS(M23)-(N23+N24)/2+10),0)),0)","v":0},null,null,null,{"$f":"IF(AND(R23>0,R24>0),IF(OR(R23>10,R23<0,R24>10,R24<0),\"Fehler\",IF(ABS(P23)-ABS(Q23)-(R23+R24)/2+10>0,IF(P23<0,-(ABS(P23)-ABS(Q23)-(R23+R24)/2+10),P23-ABS(Q23)-(R23+R24)/2+10),0)),0)","v":0},null,null,null,{"$f":"IF(AND(V23>0,V24>0),IF(OR(V23>10,V23<0,V24>10,V24<0),\"Fehler\",IF(ABS(T23)-ABS(U23)-(V23+V24)/2+10>0,IF(T23<0,-(ABS(T23)-ABS(U23)-(V23+V24)/2+10),T23-ABS(U23)-(V23+V24)/2+10),0)),0)","v":0},null,null,null,{"$f":"IF(AND(Z23>0,Z24>0),IF(OR(Z23>10,Z23<0,Z24>10,Z24<0),\"Fehler\",IF(ABS(X23)-ABS(Y23)-(Z23+Z24)/2+10>0,IF(X23<0,-(ABS(X23)-ABS(Y23)-(Z23+Z24)/2+10),X23-ABS(Y23)-(Z23+Z24)/2+10),0)),0)","v":0},{"$f":"ABS(G23)+ABS(K23)+ABS(O23)+ABS(S23)+ABS(W23)+ABS(AA23)","v":0}]
[]
[null,{"$f":"IF(A25>0,B23,\"\")","v":""},{"$f":"IF(A25<>\"\", VLOOKUP(A25,'Wertungszettel M7'!A$7:B$36,2,0),\"\")","v":""},null,null,null,{"$f":"IF(AND(F25>0,F26>0),IF(OR(F25>10,F25<0,F26>10,F26<0),\"Fehler\",IF(ABS(D25)-ABS(E25)-(F25+F26)/2+10>0,IF(D25<0,-(ABS(D25)-ABS(E25)-(F25+F26)/2+10),D25-ABS(E25)-(F25+F26)/2+10),0)),0)","v":0},null,null,null,{"$f":"IF(AND(J25>0,J26>0),IF(OR(J25>10,J25<0,J26>10,J26<0),\"Fehler\",IF(ABS(H25)-ABS(I25)-(J25+J26)/2+10>0,IF(H25<0,-(ABS(H25)-ABS(I25)-(J25+J26)/2+10),H25-ABS(I25)-(J25+J26)/2+10),0)),0)","v":0},null,null,null,{"$f":"IF(AND(N25>0,N26>0),IF(OR(N25>10,N25<0,N26>10,N26<0),\"Fehler\",IF(ABS(L25)-ABS(M25)-(N25+N26)/2+10>0,IF(L25<0,-(ABS(L25)-ABS(M25)-(N25+N26)/2+10),L25-ABS(M25)-(N25+N26)/2+10),0)),0)","v":0},null,null,null,{"$f":"IF(AND(R25>0,R26>0),IF(OR(R25>10,R25<0,R26>10,R26<0),\"Fehler\",IF(ABS(P25)-ABS(Q25)-(R25+R26)/2+10>0,IF(P25<0,-(ABS(P25)-ABS(Q25)-(R25+R26)/2+10),P25-ABS(Q25)-(R25+R26)/2+10),0)),0)","v":0},null,null,null,{"$f":"IF(AND(V25>0,V26>0),IF(OR(V25>10,V25<0,V26>10,V26<0),\"Fehler\",IF(ABS(T25)-ABS(U25)-(V25+V26)/2+10>0,IF(T25<0,-(ABS(T25)-ABS(U25)-(V25+V26)/2+10),T25-ABS(U25)-(V25+V26)/2+10),0)),0)","v":0},null,null,null,{"$f":"IF(AND(Z25>0,Z26>0),IF(OR(Z25>10,Z25<0,Z26>10,Z26<0),\"Fehler\",IF(ABS(X25)-ABS(Y25)-(Z25+Z26)/2+10>0,IF(X25<0,-(ABS(X25)-ABS(Y25)-(Z25+Z26)/2+10),X25-ABS(Y25)-(Z25+Z26)/2+10),0)),0)","v":0},{"$f":"ABS(G25)+ABS(K25)+ABS(O25)+ABS(S25)+ABS(W25)+ABS(AA25)","v":0}]
[]
[null,{"$f":"IF(A27>0,B25,\"\")","v":""},{"$f":"IF(A27<>\"\", VLOOKUP(A27,'Wertungszettel M7'!A$7:B$36,2,0),\"\")","v":""},null,null,null,{"$f":"IF(AND(F27>0,F28>0),IF(OR(F27>10,F27<0,F28>10,F28<0),\"Fehler\",IF(ABS(D27)-ABS(E27)-(F27+F28)/2+10>0,IF(D27<0,-(ABS(D27)-ABS(E27)-(F27+F28)/2+10),D27-ABS(E27)-(F27+F28)/2+10),0)),0)","v":0},null,null,null,{"$f":"IF(AND(J27>0,J28>0),IF(OR(J27>10,J27<0,J28>10,J28<0),\"Fehler\",IF(ABS(H27)-ABS(I27)-(J27+J28)/2+10>0,IF(H27<0,-(ABS(H27)-ABS(I27)-(J27+J28)/2+10),H27-ABS(I27)-(J27+J28)/2+10),0)),0)","v":0},null,null,null,{"$f":"IF(AND(N27>0,N28>0),IF(OR(N27>10,N27<0,N28>10,N28<0),\"Fehler\",IF(ABS(L27)-ABS(M27)-(N27+N28)/2+10>0,IF(L27<0,-(ABS(L27)-ABS(M27)-(N27+N28)/2+10),L27-ABS(M27)-(N27+N28)/2+10),0)),0)","v":0},null,null,null,{"$f":"IF(AND(R27>0,R28>0),IF(OR(R27>10,R27<0,R28>10,R28<0),\"Fehler\",IF(ABS(P27)-ABS(Q27)-(R27+R28)/2+10>0,IF(P27<0,-(ABS(P27)-ABS(Q27)-(R27+R28)/2+10),P27-ABS(Q27)-(R27+R28)/2+10),0)),0)","v":0},null,null,null,{"$f":"IF(AND(V27>0,V28>0),IF(OR(V27>10,V27<0,V28>10,V28<0),\"Fehler\",IF(ABS(T27)-ABS(U27)-(V27+V28)/2+10>0,IF(T27<0,-(ABS(T27)-ABS(U27)-(V27+V28)/2+10),T27-ABS(U27)-(V27+V28)/2+10),0)),0)","v":0},null,null,null,{"$f":"IF(AND(Z27>0,Z28>0),IF(OR(Z27>10,Z27<0,Z28>10,Z28<0),\"Fehler\",IF(ABS(X27)-ABS(Y27)-(Z27+Z28)/2+10>0,IF(X27<0,-(ABS(X27)-ABS(Y27)-(Z27+Z28)/2+10),X27-ABS(Y27)-(Z27+Z28)/2+10),0)),0)","v":0},{"$f":"ABS(G27)+ABS(K27)+ABS(O27)+ABS(S27)+ABS(W27)+ABS(AA27)","v":0}]
[]
[]
[null,null,null,null,null,null,{"$f":"SUM(LARGE(G9:G28,1),LARGE(G9:G28,2),LARGE(G9:G28,3))","v":41.1},null,null,null,{"$f":"SUM(LARGE(K9:K28,1),LARGE(K9:K28,2),LARGE(K9:K28,3))","v":36.400000000000006},null,null,null,{"$f":"SUM(LARGE(O9:O28,1),LARGE(O9:O28,2),LARGE(O9:O28,3))","v":38.099999999999994},null,null,null,{"$f":"SUM(LARGE(S9:S28,1),LARGE(S9:S28,2),LARGE(S9:S28,3))","v":41.75},null,null,null,{"$f":"SUM(LARGE(W9:W28,1),LARGE(W9:W28,2),LARGE(W9:W28,3))","v":33.700000000000003},null,null,null,{"$f":"SUM(LARGE(AA9:AA28,1),LARGE(AA9:AA28,2),LARGE(AA9:AA28,3))","v":37.549999999999997},{"$f":"SUM(G30,K30,O30,S30,W30,AA30)","v":228.60000000000002}]

{"sheet":"M8","index":11,"n_rows":30,"n_cols":33,"rows_kept":30,"cut":false,"hidden":true,"merged":[[26,27,27,27],[26,16,27,16],[26,18,27,18],[26,19,27,19],[26,20,27,20],[26,22,27,22],[26,23,27,23],[26,8,27,8],[26,10,27,10],[26,11,27,11],[26,12,27,12],[26,14,27,14],[26,15,27,15],[24,24,25,24],[24,26,25,26],[24,27,25,27],[26,0,27,0],[26,1,27,1],[26,2,27,2],[26,3,27,3],[26,4,27,4],[26,6,27,6],[26,7,27,7],[24,16,25,16],[24,18,25,18],[24,19,25,19],[24,20,25,20],[24,22,25,22],[24,23,25,23],[24,8,25,8],[24,10,25,10],[24,11,25,11],[24,12,25,12],[24,14,25,14],[24,15,25,15],[26,24,27,24],[26,26,27,26],[22,20,23,20],[22,22,23,22],[22,23,23,23],[22,8,23,8],[22,10,23,10],[22,11,23,11],[22,12,23,12],[22,14,23,14],[22,15,23,15],[24,0,25,0],[24,1,25,1],[24,2,25,2],[24,3,25,3],[24,4,25,4],[24,6,25,6],[24,7,25,7],[22,16,23,16],[22,18,23,18],[20,27,21,27],[22,0,23,0],[22,1,23,1],[22,2,23,2],[22,3,23,3],[22,4,23,4],[22,6,23,6],[22,7,23,7],[20,16,21,16],[20,18,21,18],[20,19,21,19],[20,20,21,20],[20,22,21,22],[20,23,21,23],[20,8,21,8],[20,10,21,10],[20,11,21,11],[20,12,21,12],[20,14,21,14],[20,15,21,15],[22,24,23,24],[22,26,23,26],[22,27,23,27],[22,19,23,19],[18,24,19,24],[18,26,19,26],[18,27,19,27],[20,0,21,0],[20,1,21,1],[20,2,21,2],[20,3,21,3],[20,4,21,4],[20,6,21,6],[20,7,21,7],[18,16,19,16],[18,18,19,18],[18,19,19,19],[18,20,19,20],[18,22,19,22],[18,23,19,23],[18,8,19,8],[18,10,19,10],[18,11,19,11],[18,12,19,12],[18,14,19,14],[18,15,19,15],[20,24,21,24],[20,26,21,26],[16,20,17,20],[16,22,17,22],[16,23,17,23],[16,8,17,8],[16,10,17,10],[16,11,17,11],[16,12,17,12],[16,14,17,14],[16,15,17,15],[18,0,19,0],[18,1,19,1],[18,2,19,2],[18,3,19,3],[18,4,19,4],[18,6,19,6],[18,7,19,7],[16,16,17,16],[16,18,17,18],[14,27,15,27],[16,0,17,0],[16,1,17,1],[16,2,17,2],[16,3,17,3],[16,4,17,4],[16,6,17,6],[16,7,17,7],[14,16,15,16],[14,18,15,18],[14,19,15,19],[14,20,15,20],[14,22,15,22],[14,23,15,23],[14,8,15,8],[14,10,15,10],[14,11,15,11],[14,12,15,12],[14,14,15,14],[14,15,15,15],[16,24,17,24],[16,26,17,26],[16,27,17,27],[16,19,17,19],[12,24,13,24],[12,26,13,26],[12,27,13,27],[14,0,15,0],[14,1,15,1],[14,2,15,2],[14,3,15,3],[14,4,15,4],[14,6,15,6],[14,7,15,7],[12,16,13,16],[12,18,13,18],[12,19,13,19],[12,20,13,20],[12,22,13,22],[12,23,13,23],[12,8,13,8],[12,10,13,10],[12,11,13,11],[12,12,13,12],[12,14,13,14],[12,15,13,15],[14,24,15,24],[14,26,15,26],[10,19,11,19],[10,20,11,20],[10,22,11,22],[10,7,11,7],[10,8,11,8],[10,10,11,10],[10,11,11,11],[10,12,11,12],[10,14,11,14],[12,0,13,0],[12,1,13,1],[12,2,13,2],[12,3,13,3],[12,4,13,4],[12,6,13,6],[12,7,13,7],[10,16,11,16],[10,18,11,18],[10,15,11,15],[8,27,9,27],[10,0,11,0],[10,1,11,1],[10,2,11,2],[10,3,11,3],[10,4,11,4],[10,6,11,6],[8,15,9,15],[8,16,9,16],[8,18,9,18],[8,19,9,19],[8,20,9,20],[10,23,11,23],[8,7,9,7],[8,8,9,8],[8,10,9,10],[8,11,9,11],[8,12,9,12],[8,14,9,14],[8,0,9,0],[8,1,9,1],[10,24,11,24],[10,26,11,26],[10,27,11,27],[6,23,6,26],[0,12,0,13],[2,0,2,1],[2,5,2,7],[2,12,2,13],[8,2,9,2],[8,3,9,3],[8,4,9,4],[8,6,9,6],[6,3,6,6],[6,7,6,10],[6,11,6,14],[6,15,6,18],[6,19,6,22],[8,23,9,23],[8,24,9,24],[8,26,9,26],[8,22,9,22],[2,14,2,16],[0,14,0,16],[4,14,4,16]]}
["Wettkampfbogen",null,null,null,null,null,null,null,null,null,null,null,"Datum:",null,{"$f":"'INFO Blatt'!B13","v":"2018-03-03"}]
[]
[null,null,null,null,null,null,null,null,null,null,null,null,"Ort:",null,{"$f":"'INFO Blatt'!B11","v":"Hehlen"}]
[]
[null,null,null,null,null,null,null,null,null,null,null,null,null,"Liga:",{"$f":"'INFO Blatt'!B7","v":"Schülerliga Süd"}]
[]
["Name","Verein","Jg","Boden",null,null,null,"Pferd",null,null,null,"Ringe",null,null,null,"Sprung",null,null,null,"Barren",null,null,null,"Reck",null,null,null,"Ges."]
[null,null,null,"D-Note","Abzug OK","E- Abzug","Note","D-Note","Abzug OK","E- Abzug","Note","D-Note","Abzug OK","E-Abzug","Note","D-Note","Abzug OK","E-Abzug","Note","D-Note","Abzug OK","E-Abzug","Note","D-Note","Abzug OK","E-Abzug","Note"]
[null,{"$f":"Formeln!A12","v":"M8"},{"$f":"IF(A9<>\"\", VLOOKUP(A9,'Wertungszettel M8'!A$7:B$36,2,0),\"\")","v":""},null,null,null,{"$f":"IF(AND(F9>0,F10>0),IF(OR(F9>10,F9<0,F10>10,F10<0),\"Fehler\",IF(ABS(D9)-ABS(E9)-(F9+F10)/2+10>0,IF(D9<0,-(ABS(D9)-ABS(E9)-(F9+F10)/2+10),D9-ABS(E9)-(F9+F10)/2+10),0)),0)","v":0},null,null,null,{"$f":"IF(AND(J9>0,J10>0),IF(OR(J9>10,J9<0,J10>10,J10<0),\"Fehler\",IF(ABS(H9)-ABS(I9)-(J9+J10)/2+10>0,IF(H9<0,-(ABS(H9)-ABS(I9)-(J9+J10)/2+10),H9-ABS(I9)-(J9+J10)/2+10),0)),0)","v":0},null,null,null,{"$f":"IF(AND(N9>0,N10>0),IF(OR(N9>10,N9<0,N10>10,N10<0),\"Fehler\",IF(ABS(L9)-ABS(M9)-(N9+N10)/2+10>0,IF(L9<0,-(ABS(L9)-ABS(M9)-(N9+N10)/2+10),L9-ABS(M9)-(N9+N10)/2+10),0)),0)","v":0},null,null,null,{"$f":"IF(AND(R9>0,R10>0),IF(OR(R9>10,R9<0,R10>10,R10<0),\"Fehler\",IF(ABS(P9)-ABS(Q9)-(R9+R10)/2+10>0,IF(P9<0,-(ABS(P9)-ABS(Q9)-(R9+R10)/2+10),P9-ABS(Q9)-(R9+R10)/2+10),0)),0)","v":0},null,null,null,{"$f":"IF(AND(V9>0,V10>0),IF(OR(V9>10,V9<0,V10>10,V10<0),\"Fehler\",IF(ABS(T9)-ABS(U9)-(V9+V10)/2+10>0,IF(T9<0,-(ABS(T9)-ABS(U9)-(V9+V10)/2+10),T9-ABS(U9)-(V9+V10)/2+10),0)),0)","v":0},null,null,null,{"$f":"IF(AND(Z9>0,Z10>0),IF(OR(Z9>10,Z9<0,Z10>10,Z10<0),\"Fehler\",IF(ABS(X9)-ABS(Y9)-(Z9+Z10)/2+10>0,IF(X9<0,-(ABS(X9)-ABS(Y9)-(Z9+Z10)/2+10),X9-ABS(Y9)-(Z9+Z10)/2+10),0)),0)","v":0},{"$f":"ABS(G9)+ABS(K9)+ABS(O9)+ABS(S9)+ABS(W9)+ABS(AA9)","v":0}]
[]
[null,{"$f":"IF(A11>0,B9,\"\")","v":""},{"$f":"IF(A11<>\"\", VLOOKUP(A11,'Wertungszettel M8'!A$7:B$36,2,0),\"\")","v":""},null,null,null,{"$f":"IF(AND(F11>0,F12>0),IF(OR(F11>10,F11<0,F12>10,F12<0),\"Fehler\",IF(ABS(D11)-ABS(E11)-(F11+F12)/2+10>0,IF(D11<0,-(ABS(D11)-ABS(E11)-(F11+F12)/2+10),D11-ABS(E11)-(F11+F12)/2+10),0)),0)","v":0},null,null,null,{"$f":"IF(AND(J11>0,J12>0),IF(OR(J11>10,J11<0,J12>10,J12<0),\"Fehler\",IF(ABS(H11)-ABS(I11)-(J11+J12)/2+10>0,IF(H11<0,-(ABS(H11)-ABS(I11)-(J11+J12)/2+10),H11-ABS(I11)-(J11+J12)/2+10),0)),0)","v":0},null,null,null,{"$f":"IF(AND(N11>0,N12>0),IF(OR(N11>10,N11<0,N12>10,N12<0),\"Fehler\",IF(ABS(L11)-ABS(M11)-(N11+N12)/2+10>0,IF(L11<0,-(ABS(L11)-ABS(M11)-(N11+N12)/2+10),L11-ABS(M11)-(N11+N12)/2+10),0)),0)","v":0},null,null,null,{"$f":"IF(AND(R11>0,R12>0),IF(OR(R11>10,R11<0,R12>10,R12<0),\"Fehler\",IF(ABS(P11)-ABS(Q11)-(R11+R12)/2+10>0,IF(P11<0,-(ABS(P11)-ABS(Q11)-(R11+R12)/2+10),P11-ABS(Q11)-(R11+R12)/2+10),0)),0)","v":0},null,null,null,{"$f":"IF(AND(V11>0,V12>0),IF(OR(V11>10,V11<0,V12>10,V12<0),\"Fehler\",IF(ABS(T11)-ABS(U11)-(V11+V12)/2+10>0,IF(T11<0,-(ABS(T11)-ABS(U11)-(V11+V12)/2+10),T11-ABS(U11)-(V11+V12)/2+10),0)),0)","v":0},null,null,null,{"$f":"IF(AND(Z11>0,Z12>0),IF(OR(Z11>10,Z11<0,Z12>10,Z12<0),\"Fehler\",IF(ABS(X11)-ABS(Y11)-(Z11+Z12)/2+10>0,IF(X11<0,-(ABS(X11)-ABS(Y11)-(Z11+Z12)/2+10),X11-ABS(Y11)-(Z11+Z12)/2+10),0)),0)","v":0},{"$f":"ABS(G11)+ABS(K11)+ABS(O11)+ABS(S11)+ABS(W11)+ABS(AA11)","v":0},null,null,null,"Boden",{"$f":"IF(G30>1,1,0)","v":0}]
[null,null,null,null,null,null,null,null,null,null,null,null,null,null,null,null,null,null,null,null,null,null,null,null,null,null,null,null,null,null,null,"pauschenpferd",{"$f":"IF(K30>1,1,0)","v":0}]
[null,{"$f":"IF(A13>0,B11,\"\")","v":""},{"$f":"IF(A13<>\"\", VLOOKUP(A13,'Wertungszettel M8'!A$7:B$36,2,0),\"\")","v":""},null,null,null,{"$f":"IF(AND(F13>0,F14>0),IF(OR(F13>10,F13<0,F14>10,F14<0),\"Fehler\",IF(ABS(D13)-ABS(E13)-(F13+F14)/2+10>0,IF(D13<0,-(ABS(D13)-ABS(E13)-(F13+F14)/2+10),D13-ABS(E13)-(F13+F14)/2+10),0)),0)","v":0},null,null,null,{"$f":"IF(AND(J13>0,J14>0),IF(OR(J13>10,J13<0,J14>10,J14<0),\"Fehler\",IF(ABS(H13)-ABS(I13)-(J13+J14)/2+10>0,IF(H13<0,-(ABS(H13)-ABS(I13)-(J13+J14)/2+10),H13-ABS(I13)-(J13+J14)/2+10),0)),0)","v":0},null,null,null,{"$f":"IF(AND(N13>0,N14>0),IF(OR(N13>10,N13<0,N14>10,N14<0),\"Fehler\",IF(ABS(L13)-ABS(M13)-(N13+N14)/2+10>0,IF(L13<0,-(ABS(L13)-ABS(M13)-(N13+N14)/2+10),L13-ABS(M13)-(N13+N14)/2+10),0)),0)","v":0},null,null,null,{"$f":"IF(AND(R13>0,R14>0),IF(OR(R13>10,R13<0,R14>10,R14<0),\"Fehler\",IF(ABS(P13)-ABS(Q13)-(R13+R14)/2+10>0,IF(P13<0,-(ABS(P13)-ABS(Q13)-(R13+R14)/2+10),P13-ABS(Q13)-(R13+R14)/2+10),0)),0)","v":0},null,null,null,{"$f":"IF(AND(V13>0,V14>0),IF(OR(V13>10,V13<0,V14>10,V14<0),\"Fehler\",IF(ABS(T13)-ABS(U13)-(V13+V14)/2+10>0,IF(T13<0,-(ABS(T13)-ABS(U13)-(V13+V14)/2+10),T13-ABS(U13)-(V13+V14)/2+10),0)),0)","v":0},null,null,null,{"$f":"IF(AND(Z13>0,Z14>0),IF(OR(Z13>10,Z13<0,Z14>10,Z14<0),\"Fehler\",IF(ABS(X13)-ABS(Y13)-(Z13+Z14)/2+10>0,IF(X13<0,-(ABS(X13)-ABS(Y13)-(Z13+Z14)/2+10),X13-ABS(Y13)-(Z13+Z14)/2+10),0)),0)","v":0},{"$f":"ABS(G13)+ABS(K13)+ABS(O13)+ABS(S13)+ABS(W13)+ABS(AA13)","v":0},null,null,null,"ringe",{"$f":"IF(O30>1,1,0)","v":0}]
[null,null,null,null,null,null,null,null,null,null,null,null,null,null,null,null,null,null,null,null,null,null,null,null,null,null,null,null,null,null,null,"sprung",{"$f":"IF(S30>1,1,0)","v":0}]
[null,{"$f":"IF(A15>0,B13,\"\")","v":""},{"$f":"IF(A15<>\"\", VLOOKUP(A15,'Wertungszettel M8'!A$7:B$36,2,0),\"\")","v":""},null,null,null,{"$f":"IF(AND(F15>0,F16>0),IF(OR(F15>10,F15<0,F16>10,F16<0),\"Fehler\",IF(ABS(D15)-ABS(E15)-(F15+F16)/2+10>0,IF(D15<0,-(ABS(D15)-ABS(E15)-(F15+F16)/2+10),D15-ABS(E15)-(F15+F16)/2+10),0)),0)","v":0},null,null,null,{"$f":"IF(AND(J15>0,J16>0),IF(OR(J15>10,J15<0,J16>10,J16<0),\"Fehler\",IF(ABS(H15)-ABS(I15)-(J15+J16)/2+10>0,IF(H15<0,-(ABS(H15)-ABS(I15)-(J15+J16)/2+10),H15-ABS(I15)-(J15+J16)/2+10),0)),0)","v":0},null,null,null,{"$f":"IF(AND(N15>0,N16>0),IF(OR(N15>10,N15<0,N16>10,N16<0),\"Fehler\",IF(ABS(L15)-ABS(M15)-(N15+N16)/2+10>0,IF(L15<0,-(ABS(L15)-ABS(M15)-(N15+N16)/2+10),L15-ABS(M15)-(N15+N16)/2+10),0)),0)","v":0},null,null,null,{"$f":"IF(AND(R15>0,R16>0),IF(OR(R15>10,R15<0,R16>10,R16<0),\"Fehler\",IF(ABS(P15)-ABS(Q15)-(R15+R16)/2+10>0,IF(P15<0,-(ABS(P15)-ABS(Q15)-(R15+R16)/2+10),P15-ABS(Q15)-(R15+R16)/2+10),0)),0)","v":0},null,null,null,{"$f":"IF(AND(V15>0,V16>0),IF(OR(V15>10,V15<0,V16>10,V16<0),\"Fehler\",IF(ABS(T15)-ABS(U15)-(V15+V16)/2+10>0,IF(T15<0,-(ABS(T15)-ABS(U15)-(V15+V16)/2+10),T15-ABS(U15)-(V15+V16)/2+10),0)),0)","v":0},null,null,null,{"$f":"IF(AND(Z15>0,Z16>0),IF(OR(Z15>10,Z15<0,Z16>10,Z16<0),\"Fehler\",IF(ABS(X15)-ABS(Y15)-(Z15+Z16)/2+10>0,IF(X15<0,-(ABS(X15)-ABS(Y15)-(Z15+Z16)/2+10),X15-ABS(Y15)-(Z15+Z16)/2+10),0)),0)","v":0},{"$f":"ABS(G15)+ABS(K15)+ABS(O15)+ABS(S15)+ABS(W15)+ABS(AA15)","v":0},null,null,null,"Barren",{"$f":"IF(W30>1,1,0)","v":0}]
[null,null,null,null,null,null,null,null,null,null,null,null,null,null,null,null,null,null,null,null,null,null,null,null,null,null,null,null,null,null,null,"Reck",{"$f":"IF(AA30>1,1,0)","v":0}]
[null,{"$f":"IF(A17>0,B15,\"\")","v":""},{"$f":"IF(A17<>\"\", VLOOKUP(A17,'Wertungszettel M8'!A$7:B$36,2,0),\"\")","v":""},null,null,null,{"$f":"IF(AND(F17>0,F18>0),IF(OR(F17>10,F17<0,F18>10,F18<0),\"Fehler\",IF(ABS(D17)-ABS(E17)-(F17+F18)/2+10>0,IF(D17<0,-(ABS(D17)-ABS(E17)-(F17+F18)/2+10),D17-ABS(E17)-(F17+F18)/2+10),0)),0)","v":0},null,null,null,{"$f":"IF(AND(J17>0,J18>0),IF(OR(J17>10,J17<0,J18>10,J18<0),\"Fehler\",IF(ABS(H17)-ABS(I17)-(J17+J18)/2+10>0,IF(H17<0,-(ABS(H17)-ABS(I17)-(J17+J18)/2+10),H17-ABS(I17)-(J17+J18)/2+10),0)),0)","v":0},null,null,null,{"$f":"IF(AND(N17>0,N18>0),IF(OR(N17>10,N17<0,N18>10,N18<0),\"Fehler\",IF(ABS(L17)-ABS(M17)-(N17+N18)/2+10>0,IF(L17<0,-(ABS(L17)-ABS(M17)-(N17+N18)/2+10),L17-ABS(M17)-(N17+N18)/2+10),0)),0)","v":0},null,null,null,{"$f":"IF(AND(R17>0,R18>0),IF(OR(R17>10,R17<0,R18>10,R18<0),\"Fehler\",IF(ABS(P17)-ABS(Q17)-(R17+R18)/2+10>0,IF(P17<0,-(ABS(P17)-ABS(Q17)-(R17+R18)/2+10),P17-ABS(Q17)-(R17+R18)/2+10),0)),0)","v":0},null,null,null,{"$f":"IF(AND(V17>0,V18>0),IF(OR(V17>10,V17<0,V18>10,V18<0),\"Fehler\",IF(ABS(T17)-ABS(U17)-(V17+V18)/2+10>0,IF(T17<0,-(ABS(T17)-ABS(U17)-(V17+V18)/2+10),T17-ABS(U17)-(V17+V18)/2+10),0)),0)","v":0},null,null,null,{"$f":"IF(AND(Z17>0,Z18>0),IF(OR(Z17>10,Z17<0,Z18>10,Z18<0),\"Fehler\",IF(ABS(X17)-ABS(Y17)-(Z17+Z18)/2+10>0,IF(X17<0,-(ABS(X17)-ABS(Y17)-(Z17+Z18)/2+10),X17-ABS(Y17)-(Z17+Z18)/2+10),0)),0)","v":0},{"$f":"ABS(G17)+ABS(K17)+ABS(O17)+ABS(S17)+ABS(W17)+ABS(AA17)","v":0}]
[null,null,null,null,null,null,null,null,null,null,null,null,null,null,null,null,null,null,null,null,null,null,null,null,null,null,null,null,null,null,null,"Gesamt",{"$f":"SUM(AG11:AG17)","v":0}]
[null,{"$f":"IF(A19>0,B17,\"\")","v":""},{"$f":"IF(A19<>\"\", VLOOKUP(A19,'Wertungszettel M8'!A$7:B$36,2,0),\"\")","v":""},null,null,null,{"$f":"IF(AND(F19>0,F20>0),IF(OR(F19>10,F19<0,F20>10,F20<0),\"Fehler\",IF(ABS(D19)-ABS(E19)-(F19+F20)/2+10>0,IF(D19<0,-(ABS(D19)-ABS(E19)-(F19+F20)/2+10),D19-ABS(E19)-(F19+F20)/2+10),0)),0)","v":0},null,null,null,{"$f":"IF(AND(J19>0,J20>0),IF(OR(J19>10,J19<0,J20>10,J20<0),\"Fehler\",IF(ABS(H19)-ABS(I19)-(J19+J20)/2+10>0,IF(H19<0,-(ABS(H19)-ABS(I19)-(J19+J20)/2+10),H19-ABS(I19)-(J19+J20)/2+10),0)),0)","v":0},null,null,null,{"$f":"IF(AND(N19>0,N20>0),IF(OR(N19>10,N19<0,N20>10,N20<0),\"Fehler\",IF(ABS(L19)-ABS(M19)-(N19+N20)/2+10>0,IF(L19<0,-(ABS(L19)-ABS(M19)-(N19+N20)/2+10),L19-ABS(M19)-(N19+N20)/2+10),0)),0)","v":0},null,null,null,{"$f":"IF(AND(R19>0,R20>0),IF(OR(R19>10,R19<0,R20>10,R20<0),\"Fehler\",IF(ABS(P19)-ABS(Q19)-(R19+R20)/2+10>0,IF(P19<0,-(ABS(P19)-ABS(Q19)-(R19+R20)/2+10),P19-ABS(Q19)-(R19+R20)/2+10),0)),0)","v":0},null,null,null,{"$f":"IF(AND(V19>0,V20>0),IF(OR(V19>10,V19<0,V20>10,V20<0),\"Fehler\",IF(ABS(T19)-ABS(U19)-(V19+V20)/2+10>0,IF(T19<0,-(ABS(T19)-ABS(U19)-(V19+V20)/2+10),T19-ABS(U19)-(V19+V20)/2+10),0)),0)","v":0},null,null,null,{"$f":"IF(AND(Z19>0,Z20>0),IF(OR(Z19>10,Z19<0,Z20>10,Z20<0),\"Fehler\",IF(ABS(X19)-ABS(Y19)-(Z19+Z20)/2+10>0,IF(X19<0,-(ABS(X19)-ABS(Y19)-(Z19+Z20)/2+10),X19-ABS(Y19)-(Z19+Z20)/2+10),0)),0)","v":0},{"$f":"ABS(G19)+ABS(K19)+ABS(O19)+ABS(S19)+ABS(W19)+ABS(AA19)","v":0}]
[]
[null,{"$f":"IF(A21>0,B19,\"\")","v":""},{"$f":"IF(A21<>\"\", VLOOKUP(A21,'Wertungszettel M8'!A$7:B$36,2,0),\"\")","v":""},null,null,null,{"$f":"IF(AND(F21>0,F22>0),IF(OR(F21>10,F21<0,F22>10,F22<0),\"Fehler\",IF(ABS(D21)-ABS(E21)-(F21+F22)/2+10>0,IF(D21<0,-(ABS(D21)-ABS(E21)-(F21+F22)/2+10),D21-ABS(E21)-(F21+F22)/2+10),0)),0)","v":0},null,null,null,{"$f":"IF(AND(J21>0,J22>0),IF(OR(J21>10,J21<0,J22>10,J22<0),\"Fehler\",IF(ABS(H21)-ABS(I21)-(J21+J22)/2+10>0,IF(H21<0,-(ABS(H21)-ABS(I21)-(J21+J22)/2+10),H21-ABS(I21)-(J21+J22)/2+10),0)),0)","v":0},null,null,null,{"$f":"IF(AND(N21>0,N22>0),IF(OR(N21>10,N21<0,N22>10,N22<0),\"Fehler\",IF(ABS(L21)-ABS(M21)-(N21+N22)/2+10>0,IF(L21<0,-(ABS(L21)-ABS(M21)-(N21+N22)/2+10),L21-ABS(M21)-(N21+N22)/2+10),0)),0)","v":0},null,null,null,{"$f":"IF(AND(R21>0,R22>0),IF(OR(R21>10,R21<0,R22>10,R22<0),\"Fehler\",IF(ABS(P21)-ABS(Q21)-(R21+R22)/2+10>0,IF(P21<0,-(ABS(P21)-ABS(Q21)-(R21+R22)/2+10),P21-ABS(Q21)-(R21+R22)/2+10),0)),0)","v":0},null,null,null,{"$f":"IF(AND(V21>0,V22>0),IF(OR(V21>10,V21<0,V22>10,V22<0),\"Fehler\",IF(ABS(T21)-ABS(U21)-(V21+V22)/2+10>0,IF(T21<0,-(ABS(T21)-ABS(U21)-(V21+V22)/2+10),T21-ABS(U21)-(V21+V22)/2+10),0)),0)","v":0},null,null,null,{"$f":"IF(AND(Z21>0,Z22>0),IF(OR(Z21>10,Z21<0,Z22>10,Z22<0),\"Fehler\",IF(ABS(X21)-ABS(Y21)-(Z21+Z22)/2+10>0,IF(X21<0,-(ABS(X21)-ABS(Y21)-(Z21+Z22)/2+10),X21-ABS(Y21)-(Z21+Z22)/2+10),0)),0)","v":0},{"$f":"ABS(G21)+ABS(K21)+ABS(O21)+ABS(S21)+ABS(W21)+ABS(AA21)","v":0}]
[]
[null,{"$f":"IF(A23>0,B21,\"\")","v":""},{"$f":"IF(A23<>\"\", VLOOKUP(A23,'Wertungszettel M8'!A$7:B$36,2,0),\"\")","v":""},null,null,null,{"$f":"IF(AND(F23>0,F24>0),IF(OR(F23>10,F23<0,F24>10,F24<0),\"Fehler\",IF(ABS(D23)-ABS(E23)-(F23+F24)/2+10>0,IF(D23<0,-(ABS(D23)-ABS(E23)-(F23+F24)/2+10),D23-ABS(E23)-(F23+F24)/2+10),0)),0)","v":0},null,null,null,{"$f":"IF(AND(J23>0,J24>0),IF(OR(J23>10,J23<0,J24>10,J24<0),\"Fehler\",IF(ABS(H23)-ABS(I23)-(J23+J24)/2+10>0,IF(H23<0,-(ABS(H23)-ABS(I23)-(J23+J24)/2+10),H23-ABS(I23)-(J23+J24)/2+10),0)),0)","v":0},null,null,null,{"$f":"IF(AND(N23>0,N24>0),IF(OR(N23>10,N23<0,N24>10,N24<0),\"Fehler\",IF(ABS(L23)-ABS(M23)-(N23+N24)/2+10>0,IF(L23<0,-(ABS(L23)-ABS(M23)-(N23+N24)/2+10),L23-ABS(M23)-(N23+N24)/2+10),0)),0)","v":0},null,null,null,{"$f":"IF(AND(R23>0,R24>0),IF(OR(R23>10,R23<0,R24>10,R24<0),\"Fehler\",IF(ABS(P23)-ABS(Q23)-(R23+R24)/2+10>0,IF(P23<0,-(ABS(P23)-ABS(Q23)-(R23+R24)/2+10),P23-ABS(Q23)-(R23+R24)/2+10),0)),0)","v":0},null,null,null,{"$f":"IF(AND(V23>0,V24>0),IF(OR(V23>10,V23<0,V24>10,V24<0),\"Fehler\",IF(ABS(T23)-ABS(U23)-(V23+V24)/2+10>0,IF(T23<0,-(ABS(T23)-ABS(U23)-(V23+V24)/2+10),T23-ABS(U23)-(V23+V24)/2+10),0)),0)","v":0},null,null,null,{"$f":"IF(AND(Z23>0,Z24>0),IF(OR(Z23>10,Z23<0,Z24>10,Z24<0),\"Fehler\",IF(ABS(X23)-ABS(Y23)-(Z23+Z24)/2+10>0,IF(X23<0,-(ABS(X23)-ABS(Y23)-(Z23+Z24)/2+10),X23-ABS(Y23)-(Z23+Z24)/2+10),0)),0)","v":0},{"$f":"ABS(G23)+ABS(K23)+ABS(O23)+ABS(S23)+ABS(W23)+ABS(AA23)","v":0}]
[]
[null,{"$f":"IF(A25>0,B23,\"\")","v":""},{"$f":"IF(A25<>\"\", VLOOKUP(A25,'Wertungszettel M8'!A$7:B$36,2,0),\"\")","v":""},null,null,null,{"$f":"IF(AND(F25>0,F26>0),IF(OR(F25>10,F25<0,F26>10,F26<0),\"Fehler\",IF(ABS(D25)-ABS(E25)-(F25+F26)/2+10>0,IF(D25<0,-(ABS(D25)-ABS(E25)-(F25+F26)/2+10),D25-ABS(E25)-(F25+F26)/2+10),0)),0)","v":0},null,null,null,{"$f":"IF(AND(J25>0,J26>0),IF(OR(J25>10,J25<0,J26>10,J26<0),\"Fehler\",IF(ABS(H25)-ABS(I25)-(J25+J26)/2+10>0,IF(H25<0,-(ABS(H25)-ABS(I25)-(J25+J26)/2+10),H25-ABS(I25)-(J25+J26)/2+10),0)),0)","v":0},null,null,null,{"$f":"IF(AND(N25>0,N26>0),IF(OR(N25>10,N25<0,N26>10,N26<0),\"Fehler\",IF(ABS(L25)-ABS(M25)-(N25+N26)/2+10>0,IF(L25<0,-(ABS(L25)-ABS(M25)-(N25+N26)/2+10),L25-ABS(M25)-(N25+N26)/2+10),0)),0)","v":0},null,null,null,{"$f":"IF(AND(R25>0,R26>0),IF(OR(R25>10,R25<0,R26>10,R26<0),\"Fehler\",IF(ABS(P25)-ABS(Q25)-(R25+R26)/2+10>0,IF(P25<0,-(ABS(P25)-ABS(Q25)-(R25+R26)/2+10),P25-ABS(Q25)-(R25+R26)/2+10),0)),0)","v":0},null,null,null,{"$f":"IF(AND(V25>0,V26>0),IF(OR(V25>10,V25<0,V26>10,V26<0),\"Fehler\",IF(ABS(T25)-ABS(U25)-(V25+V26)/2+10>0,IF(T25<0,-(ABS(T25)-ABS(U25)-(V25+V26)/2+10),T25-ABS(U25)-(V25+V26)/2+10),0)),0)","v":0},null,null,null,{"$f":"IF(AND(Z25>0,Z26>0),IF(OR(Z25>10,Z25<0,Z26>10,Z26<0),\"Fehler\",IF(ABS(X25)-ABS(Y25)-(Z25+Z26)/2+10>0,IF(X25<0,-(ABS(X25)-ABS(Y25)-(Z25+Z26)/2+10),X25-ABS(Y25)-(Z25+Z26)/2+10),0)),0)","v":0},{"$f":"ABS(G25)+ABS(K25)+ABS(O25)+ABS(S25)+ABS(W25)+ABS(AA25)","v":0}]
[]
[null,{"$f":"IF(A27>0,B25,\"\")","v":""},{"$f":"IF(A27<>\"\", VLOOKUP(A27,'Wertungszettel M8'!A$7:B$36,2,0),\"\")","v":""},null,null,null,{"$f":"IF(AND(F27>0,F28>0),IF(OR(F27>10,F27<0,F28>10,F28<0),\"Fehler\",IF(ABS(D27)-ABS(E27)-(F27+F28)/2+10>0,IF(D27<0,-(ABS(D27)-ABS(E27)-(F27+F28)/2+10),D27-ABS(E27)-(F27+F28)/2+10),0)),0)","v":0},null,null,null,{"$f":"IF(AND(J27>0,J28>0),IF(OR(J27>10,J27<0,J28>10,J28<0),\"Fehler\",IF(ABS(H27)-ABS(I27)-(J27+J28)/2+10>0,IF(H27<0,-(ABS(H27)-ABS(I27)-(J27+J28)/2+10),H27-ABS(I27)-(J27+J28)/2+10),0)),0)","v":0},null,null,null,{"$f":"IF(AND(N27>0,N28>0),IF(OR(N27>10,N27<0,N28>10,N28<0),\"Fehler\",IF(ABS(L27)-ABS(M27)-(N27+N28)/2+10>0,IF(L27<0,-(ABS(L27)-ABS(M27)-(N27+N28)/2+10),L27-ABS(M27)-(N27+N28)/2+10),0)),0)","v":0},null,null,null,{"$f":"IF(AND(R27>0,R28>0),IF(OR(R27>10,R27<0,R28>10,R28<0),\"Fehler\",IF(ABS(P27)-ABS(Q27)-(R27+R28)/2+10>0,IF(P27<0,-(ABS(P27)-ABS(Q27)-(R27+R28)/2+10),P27-ABS(Q27)-(R27+R28)/2+10),0)),0)","v":0},null,null,null,{"$f":"IF(AND(V27>0,V28>0),IF(OR(V27>10,V27<0,V28>10,V28<0),\"Fehler\",IF(ABS(T27)-ABS(U27)-(V27+V28)/2+10>0,IF(T27<0,-(ABS(T27)-ABS(U27)-(V27+V28)/2+10),T27-ABS(U27)-(V27+V28)/2+10),0)),0)","v":0},null,null,null,{"$f":"IF(AND(Z27>0,Z28>0),IF(OR(Z27>10,Z27<0,Z28>10,Z28<0),\"Fehler\",IF(ABS(X27)-ABS(Y27)-(Z27+Z28)/2+10>0,IF(X27<0,-(ABS(X27)-ABS(Y27)-(Z27+Z28)/2+10),X27-ABS(Y27)-(Z27+Z28)/2+10),0)),0)","v":0},{"$f":"ABS(G27)+ABS(K27)+ABS(O27)+ABS(S27)+ABS(W27)+ABS(AA27)","v":0}]
[]
[]
[null,null,null,null,null,null,{"$f":"SUM(LARGE(G9:G28,1),LARGE(G9:G28,2),LARGE(G9:G28,3))","v":0},null,null,null,{"$f":"SUM(LARGE(K9:K28,1),LARGE(K9:K28,2),LARGE(K9:K28,3))","v":0},null,null,null,{"$f":"SUM(LARGE(O9:O28,1),LARGE(O9:O28,2),LARGE(O9:O28,3))","v":0},null,null,null,{"$f":"SUM(LARGE(S9:S28,1),LARGE(S9:S28,2),LARGE(S9:S28,3))","v":0},null,null,null,{"$f":"SUM(LARGE(W9:W28,1),LARGE(W9:W28,2),LARGE(W9:W28,3))","v":0},null,null,null,{"$f":"SUM(LARGE(AA9:AA28,1),LARGE(AA9:AA28,2),LARGE(AA9:AA28,3))","v":0},{"$f":"SUM(G30,K30,O30,S30,W30,AA30)","v":0}]

{"sheet":"M9","index":12,"n_rows":30,"n_cols":28,"rows_kept":30,"cut":false,"hidden":true,"merged":[[26,27,27,27],[26,16,27,16],[26,18,27,18],[26,19,27,19],[26,20,27,20],[26,22,27,22],[26,23,27,23],[26,8,27,8],[26,10,27,10],[26,11,27,11],[26,12,27,12],[26,14,27,14],[26,15,27,15],[24,24,25,24],[24,26,25,26],[24,27,25,27],[26,0,27,0],[26,1,27,1],[26,2,27,2],[26,3,27,3],[26,4,27,4],[26,6,27,6],[26,7,27,7],[24,16,25,16],[24,18,25,18],[24,19,25,19],[24,20,25,20],[24,22,25,22],[24,23,25,23],[24,8,25,8],[24,10,25,10],[24,11,25,11],[24,12,25,12],[24,14,25,14],[24,15,25,15],[26,24,27,24],[26,26,27,26],[22,20,23,20],[22,22,23,22],[22,23,23,23],[22,8,23,8],[22,10,23,10],[22,11,23,11],[22,12,23,12],[22,14,23,14],[22,15,23,15],[24,0,25,0],[24,1,25,1],[24,2,25,2],[24,3,25,3],[24,4,25,4],[24,6,25,6],[24,7,25,7],[22,16,23,16],[22,18,23,18],[20,27,21,27],[22,0,23,0],[22,1,23,1],[22,2,23,2],[22,3,23,3],[22,4,23,4],[22,6,23,6],[22,7,23,7],[20,16,21,16],[20,18,21,18],[20,19,21,19],[20,20,21,20],[20,22,21,22],[20,23,21,23],[20,8,21,8],[20,10,21,10],[20,11,21,11],[20,12,21,12],[20,14,21,14],[20,15,21,15],[22,24,23,24],[22,26,23,26],[22,27,23,27],[22,19,23,19],[18,24,19,24],[18,26,19,26],[18,27,19,27],[20,0,21,0],[20,1,21,1],[20,2,21,2],[20,3,21,3],[20,4,21,4],[20,6,21,6],[20,7,21,7],[18,16,19,16],[18,18,19,18],[18,19,19,19],[18,20,19,20],[18,22,19,22],[18,23,19,23],[18,8,19,8],[18,10,19,10],[18,11,19,11],[18,12,19,12],[18,14,19,14],[18,15,19,15],[20,24,21,24],[20,26,21,26],[16,20,17,20],[16,22,17,22],[16,23,17,23],[16,8,17,8],[16,10,17,10],[16,11,17,11],[16,12,17,12],[16,14,17,14],[16,15,17,15],[18,0,19,0],[18,1,19,1],[18,2,19,2],[18,3,19,3],[18,4,19,4],[18,6,19,6],[18,7,19,7],[16,16,17,16],[16,18,17,18],[14,27,15,27],[16,0,17,0],[16,1,17,1],[16,2,17,2],[16,3,17,3],[16,4,17,4],[16,6,17,6],[16,7,17,7],[14,16,15,16],[14,18,15,18],[14,19,15,19],[14,20,15,20],[14,22,15,22],[14,23,15,23],[14,8,15,8],[14,10,15,10],[14,11,15,11],[14,12,15,12],[14,14,15,14],[14,15,15,15],[16,24,17,24],[16,26,17,26],[16,27,17,27],[16,19,17,19],[12,24,13,24],[12,26,13,26],[12,27,13,27],[14,0,15,0],[14,1,15,1],[14,2,15,2],[14,3,15,3],[14,4,15,4],[14,6,15,6],[14,7,15,7],[12,16,13,16],[12,18,13,18],[12,19,13,19],[12,20,13,20],[12,22,13,22],[12,23,13,23],[12,8,13,8],[12,10,13,10],[12,11,13,11],[12,12,13,12],[12,14,13,14],[12,15,13,15],[14,24,15,24],[14,26,15,26],[10,19,11,19],[10,20,11,20],[10,22,11,22],[10,7,11,7],[10,8,11,8],[10,10,11,10],[10,11,11,11],[10,12,11,12],[10,14,11,14],[12,0,13,0],[12,1,13,1],[12,2,13,2],[12,3,13,3],[12,4,13,4],[12,6,13,6],[12,7,13,7],[10,16,11,16],[10,18,11,18],[10,15,11,15],[8,27,9,27],[10,0,11,0],[10,1,11,1],[10,2,11,2],[10,3,11,3],[10,4,11,4],[10,6,11,6],[8,15,9,15],[8,16,9,16],[8,18,9,18],[8,19,9,19],[8,20,9,20],[10,23,11,23],[8,7,9,7],[8,8,9,8],[8,10,9,10],[8,11,9,11],[8,12,9,12],[8,14,9,14],[8,0,9,0],[8,1,9,1],[10,24,11,24],[10,26,11,26],[10,27,11,27],[6,23,6,26],[0,12,0,13],[2,0,2,1],[2,5,2,7],[2,12,2,13],[8,2,9,2],[8,3,9,3],[8,4,9,4],[8,6,9,6],[6,3,6,6],[6,7,6,10],[6,11,6,14],[6,15,6,18],[6,19,6,22],[8,23,9,23],[8,24,9,24],[8,26,9,26],[8,22,9,22],[2,14,2,16],[0,14,0,16],[4,14,4,16]]}
["Wettkampfbogen",null,null,null,null,null,null,null,null,null,null,null,"Datum:",null,{"$f":"'INFO Blatt'!B13","v":"2018-03-03"}]
[]
[null,null,null,null,null,null,null,null,null,null,null,null,"Ort:",null,{"$f":"'INFO Blatt'!B11","v":"Hehlen"}]
[]
[null,null,null,null,null,null,null,null,null,null,null,null,null,"Liga:",{"$f":"'INFO Blatt'!B7","v":"Schülerliga Süd"}]
[]
["Name","Verein","Jg","Boden",null,null,null,"Pferd",null,null,null,"Ringe",null,null,null,"Sprung",null,null,null,"Barren",null,null,null,"Reck",null,null,null,"Ges."]
[null,null,null,"D-Note","Abzug OK","E- Abzug","Note","D-Note","Abzug OK","E- Abzug","Note","D-Note","Abzug OK","E-Abzug","Note","D-Note","Abzug OK","E-Abzug","Note","D-Note","Abzug OK","E-Abzug","Note","D-Note","Abzug OK","E-Abzug","Note"]
[null,{"$f":"Formeln!A13","v":"M9"},{"$f":"IF(A9<>\"\", VLOOKUP(A9,'Wertungszettel M9'!A$7:B$36,2,0),\"\")","v":""},null,null,null,{"$f":"IF(AND(F9>0,F10>0),IF(OR(F9>10,F9<0,F10>10,F10<0),\"Fehler\",IF(ABS(D9)-ABS(E9)-(F9+F10)/2+10>0,IF(D9<0,-(ABS(D9)-ABS(E9)-(F9+F10)/2+10),D9-ABS(E9)-(F9+F10)/2+10),0)),0)","v":0},null,null,null,{"$f":"IF(AND(J9>0,J10>0),IF(OR(J9>10,J9<0,J10>10,J10<0),\"Fehler\",IF(ABS(H9)-ABS(I9)-(J9+J10)/2+10>0,IF(H9<0,-(ABS(H9)-ABS(I9)-(J9+J10)/2+10),H9-ABS(I9)-(J9+J10)/2+10),0)),0)","v":0},null,null,null,{"$f":"IF(AND(N9>0,N10>0),IF(OR(N9>10,N9<0,N10>10,N10<0),\"Fehler\",IF(ABS(L9)-ABS(M9)-(N9+N10)/2+10>0,IF(L9<0,-(ABS(L9)-ABS(M9)-(N9+N10)/2+10),L9-ABS(M9)-(N9+N10)/2+10),0)),0)","v":0},null,null,null,{"$f":"IF(AND(R9>0,R10>0),IF(OR(R9>10,R9<0,R10>10,R10<0),\"Fehler\",IF(ABS(P9)-ABS(Q9)-(R9+R10)/2+10>0,IF(P9<0,-(ABS(P9)-ABS(Q9)-(R9+R10)/2+10),P9-ABS(Q9)-(R9+R10)/2+10),0)),0)","v":0},null,null,null,{"$f":"IF(AND(V9>0,V10>0),IF(OR(V9>10,V9<0,V10>10,V10<0),\"Fehler\",IF(ABS(T9)-ABS(U9)-(V9+V10)/2+10>0,IF(T9<0,-(ABS(T9)-ABS(U9)-(V9+V10)/2+10),T9-ABS(U9)-(V9+V10)/2+10),0)),0)","v":0},null,null,null,{"$f":"IF(AND(Z9>0,Z10>0),IF(OR(Z9>10,Z9<0,Z10>10,Z10<0),\"Fehler\",IF(ABS(X9)-ABS(Y9)-(Z9+Z10)/2+10>0,IF(X9<0,-(ABS(X9)-ABS(Y9)-(Z9+Z10)/2+10),X9-ABS(Y9)-(Z9+Z10)/2+10),0)),0)","v":0},{"$f":"ABS(G9)+ABS(K9)+ABS(O9)+ABS(S9)+ABS(W9)+ABS(AA9)","v":0}]
[]
[null,{"$f":"IF(A11>0,B9,\"\")","v":""},{"$f":"IF(A11<>\"\", VLOOKUP(A11,'Wertungszettel M9'!A$7:B$36,2,0),\"\")","v":""},null,null,null,{"$f":"IF(AND(F11>0,F12>0),IF(OR(F11>10,F11<0,F12>10,F12<0),\"Fehler\",IF(ABS(D11)-ABS(E11)-(F11+F12)/2+10>0,IF(D11<0,-(ABS(D11)-ABS(E11)-(F11+F12)/2+10),D11-ABS(E11)-(F11+F12)/2+10),0)),0)","v":0},null,null,null,{"$f":"IF(AND(J11>0,J12>0),IF(OR(J11>10,J11<0,J12>10,J12<0),\"Fehler\",IF(ABS(H11)-ABS(I11)-(J11+J12)/2+10>0,IF(H11<0,-(ABS(H11)-ABS(I11)-(J11+J12)/2+10),H11-ABS(I11)-(J11+J12)/2+10),0)),0)","v":0},null,null,null,{"$f":"IF(AND(N11>0,N12>0),IF(OR(N11>10,N11<0,N12>10,N12<0),\"Fehler\",IF(ABS(L11)-ABS(M11)-(N11+N12)/2+10>0,IF(L11<0,-(ABS(L11)-ABS(M11)-(N11+N12)/2+10),L11-ABS(M11)-(N11+N12)/2+10),0)),0)","v":0},null,null,null,{"$f":"IF(AND(R11>0,R12>0),IF(OR(R11>10,R11<0,R12>10,R12<0),\"Fehler\",IF(ABS(P11)-ABS(Q11)-(R11+R12)/2+10>0,IF(P11<0,-(ABS(P11)-ABS(Q11)-(R11+R12)/2+10),P11-ABS(Q11)-(R11+R12)/2+10),0)),0)","v":0},null,null,null,{"$f":"IF(AND(V11>0,V12>0),IF(OR(V11>10,V11<0,V12>10,V12<0),\"Fehler\",IF(ABS(T11)-ABS(U11)-(V11+V12)/2+10>0,IF(T11<0,-(ABS(T11)-ABS(U11)-(V11+V12)/2+10),T11-ABS(U11)-(V11+V12)/2+10),0)),0)","v":0},null,null,null,{"$f":"IF(AND(Z11>0,Z12>0),IF(OR(Z11>10,Z11<0,Z12>10,Z12<0),\"Fehler\",IF(ABS(X11)-ABS(Y11)-(Z11+Z12)/2+10>0,IF(X11<0,-(ABS(X11)-ABS(Y11)-(Z11+Z12)/2+10),X11-ABS(Y11)-(Z11+Z12)/2+10),0)),0)","v":0},{"$f":"ABS(G11)+ABS(K11)+ABS(O11)+ABS(S11)+ABS(W11)+ABS(AA11)","v":0}]
[]
[null,{"$f":"IF(A13>0,B11,\"\")","v":""},{"$f":"IF(A13<>\"\", VLOOKUP(A13,'Wertungszettel M9'!A$7:B$36,2,0),\"\")","v":""},null,null,null,{"$f":"IF(AND(F13>0,F14>0),IF(OR(F13>10,F13<0,F14>10,F14<0),\"Fehler\",IF(ABS(D13)-ABS(E13)-(F13+F14)/2+10>0,IF(D13<0,-(ABS(D13)-ABS(E13)-(F13+F14)/2+10),D13-ABS(E13)-(F13+F14)/2+10),0)),0)","v":0},null,null,null,{"$f":"IF(AND(J13>0,J14>0),IF(OR(J13>10,J13<0,J14>10,J14<0),\"Fehler\",IF(ABS(H13)-ABS(I13)-(J13+J14)/2+10>0,IF(H13<0,-(ABS(H13)-ABS(I13)-(J13+J14)/2+10),H13-ABS(I13)-(J13+J14)/2+10),0)),0)","v":0},null,null,null,{"$f":"IF(AND(N13>0,N14>0),IF(OR(N13>10,N13<0,N14>10,N14<0),\"Fehler\",IF(ABS(L13)-ABS(M13)-(N13+N14)/2+10>0,IF(L13<0,-(ABS(L13)-ABS(M13)-(N13+N14)/2+10),L13-ABS(M13)-(N13+N14)/2+10),0)),0)","v":0},null,null,null,{"$f":"IF(AND(R13>0,R14>0),IF(OR(R13>10,R13<0,R14>10,R14<0),\"Fehler\",IF(ABS(P13)-ABS(Q13)-(R13+R14)/2+10>0,IF(P13<0,-(ABS(P13)-ABS(Q13)-(R13+R14)/2+10),P13-ABS(Q13)-(R13+R14)/2+10),0)),0)","v":0},null,null,null,{"$f":"IF(AND(V13>0,V14>0),IF(OR(V13>10,V13<0,V14>10,V14<0),\"Fehler\",IF(ABS(T13)-ABS(U13)-(V13+V14)/2+10>0,IF(T13<0,-(ABS(T13)-ABS(U13)-(V13+V14)/2+10),T13-ABS(U13)-(V13+V14)/2+10),0)),0)","v":0},null,null,null,{"$f":"IF(AND(Z13>0,Z14>0),IF(OR(Z13>10,Z13<0,Z14>10,Z14<0),\"Fehler\",IF(ABS(X13)-ABS(Y13)-(Z13+Z14)/2+10>0,IF(X13<0,-(ABS(X13)-ABS(Y13)-(Z13+Z14)/2+10),X13-ABS(Y13)-(Z13+Z14)/2+10),0)),0)","v":0},{"$f":"ABS(G13)+ABS(K13)+ABS(O13)+ABS(S13)+ABS(W13)+ABS(AA13)","v":0}]
[]
[null,{"$f":"IF(A15>0,B13,\"\")","v":""},{"$f":"IF(A15<>\"\", VLOOKUP(A15,'Wertungszettel M9'!A$7:B$36,2,0),\"\")","v":""},null,null,null,{"$f":"IF(AND(F15>0,F16>0),IF(OR(F15>10,F15<0,F16>10,F16<0),\"Fehler\",IF(ABS(D15)-ABS(E15)-(F15+F16)/2+10>0,IF(D15<0,-(ABS(D15)-ABS(E15)-(F15+F16)/2+10),D15-ABS(E15)-(F15+F16)/2+10),0)),0)","v":0},null,null,null,{"$f":"IF(AND(J15>0,J16>0),IF(OR(J15>10,J15<0,J16>10,J16<0),\"Fehler\",IF(ABS(H15)-ABS(I15)-(J15+J16)/2+10>0,IF(H15<0,-(ABS(H15)-ABS(I15)-(J15+J16)/2+10),H15-ABS(I15)-(J15+J16)/2+10),0)),0)","v":0},null,null,null,{"$f":"IF(AND(N15>0,N16>0),IF(OR(N15>10,N15<0,N16>10,N16<0),\"Fehler\",IF(ABS(L15)-ABS(M15)-(N15+N16)/2+10>0,IF(L15<0,-(ABS(L15)-ABS(M15)-(N15+N16)/2+10),L15-ABS(M15)-(N15+N16)/2+10),0)),0)","v":0},null,null,null,{"$f":"IF(AND(R15>0,R16>0),IF(OR(R15>10,R15<0,R16>10,R16<0),\"Fehler\",IF(ABS(P15)-ABS(Q15)-(R15+R16)/2+10>0,IF(P15<0,-(ABS(P15)-ABS(Q15)-(R15+R16)/2+10),P15-ABS(Q15)-(R15+R16)/2+10),0)),0)","v":0},null,null,null,{"$f":"IF(AND(V15>0,V16>0),IF(OR(V15>10,V15<0,V16>10,V16<0),\"Fehler\",IF(ABS(T15)-ABS(U15)-(V15+V16)/2+10>0,IF(T15<0,-(ABS(T15)-ABS(U15)-(V15+V16)/2+10),T15-ABS(U15)-(V15+V16)/2+10),0)),0)","v":0},null,null,null,{"$f":"IF(AND(Z15>0,Z16>0),IF(OR(Z15>10,Z15<0,Z16>10,Z16<0),\"Fehler\",IF(ABS(X15)-ABS(Y15)-(Z15+Z16)/2+10>0,IF(X15<0,-(ABS(X15)-ABS(Y15)-(Z15+Z16)/2+10),X15-ABS(Y15)-(Z15+Z16)/2+10),0)),0)","v":0},{"$f":"ABS(G15)+ABS(K15)+ABS(O15)+ABS(S15)+ABS(W15)+ABS(AA15)","v":0}]
[]
[null,{"$f":"IF(A17>0,B15,\"\")","v":""},{"$f":"IF(A17<>\"\", VLOOKUP(A17,'Wertungszettel M9'!A$7:B$36,2,0),\"\")","v":""},null,null,null,{"$f":"IF(AND(F17>0,F18>0),IF(OR(F17>10,F17<0,F18>10,F18<0),\"Fehler\",IF(ABS(D17)-ABS(E17)-(F17+F18)/2+10>0,IF(D17<0,-(ABS(D17)-ABS(E17)-(F17+F18)/2+10),D17-ABS(E17)-(F17+F18)/2+10),0)),0)","v":0},null,null,null,{"$f":"IF(AND(J17>0,J18>0),IF(OR(J17>10,J17<0,J18>10,J18<0),\"Fehler\",IF(ABS(H17)-ABS(I17)-(J17+J18)/2+10>0,IF(H17<0,-(ABS(H17)-ABS(I17)-(J17+J18)/2+10),H17-ABS(I17)-(J17+J18)/2+10),0)),0)","v":0},null,null,null,{"$f":"IF(AND(N17>0,N18>0),IF(OR(N17>10,N17<0,N18>10,N18<0),\"Fehler\",IF(ABS(L17)-ABS(M17)-(N17+N18)/2+10>0,IF(L17<0,-(ABS(L17)-ABS(M17)-(N17+N18)/2+10),L17-ABS(M17)-(N17+N18)/2+10),0)),0)","v":0},null,null,null,{"$f":"IF(AND(R17>0,R18>0),IF(OR(R17>10,R17<0,R18>10,R18<0),\"Fehler\",IF(ABS(P17)-ABS(Q17)-(R17+R18)/2+10>0,IF(P17<0,-(ABS(P17)-ABS(Q17)-(R17+R18)/2+10),P17-ABS(Q17)-(R17+R18)/2+10),0)),0)","v":0},null,null,null,{"$f":"IF(AND(V17>0,V18>0),IF(OR(V17>10,V17<0,V18>10,V18<0),\"Fehler\",IF(ABS(T17)-ABS(U17)-(V17+V18)/2+10>0,IF(T17<0,-(ABS(T17)-ABS(U17)-(V17+V18)/2+10),T17-ABS(U17)-(V17+V18)/2+10),0)),0)","v":0},null,null,null,{"$f":"IF(AND(Z17>0,Z18>0),IF(OR(Z17>10,Z17<0,Z18>10,Z18<0),\"Fehler\",IF(ABS(X17)-ABS(Y17)-(Z17+Z18)/2+10>0,IF(X17<0,-(ABS(X17)-ABS(Y17)-(Z17+Z18)/2+10),X17-ABS(Y17)-(Z17+Z18)/2+10),0)),0)","v":0},{"$f":"ABS(G17)+ABS(K17)+ABS(O17)+ABS(S17)+ABS(W17)+ABS(AA17)","v":0}]
[]
[null,{"$f":"IF(A19>0,B17,\"\")","v":""},{"$f":"IF(A19<>\"\", VLOOKUP(A19,'Wertungszettel M9'!A$7:B$36,2,0),\"\")","v":""},null,null,null,{"$f":"IF(AND(F19>0,F20>0),IF(OR(F19>10,F19<0,F20>10,F20<0),\"Fehler\",IF(ABS(D19)-ABS(E19)-(F19+F20)/2+10>0,IF(D19<0,-(ABS(D19)-ABS(E19)-(F19+F20)/2+10),D19-ABS(E19)-(F19+F20)/2+10),0)),0)","v":0},null,null,null,{"$f":"IF(AND(J19>0,J20>0),IF(OR(J19>10,J19<0,J20>10,J20<0),\"Fehler\",IF(ABS(H19)-ABS(I19)-(J19+J20)/2+10>0,IF(H19<0,-(ABS(H19)-ABS(I19)-(J19+J20)/2+10),H19-ABS(I19)-(J19+J20)/2+10),0)),0)","v":0},null,null,null,{"$f":"IF(AND(N19>0,N20>0),IF(OR(N19>10,N19<0,N20>10,N20<0),\"Fehler\",IF(ABS(L19)-ABS(M19)-(N19+N20)/2+10>0,IF(L19<0,-(ABS(L19)-ABS(M19)-(N19+N20)/2+10),L19-ABS(M19)-(N19+N20)/2+10),0)),0)","v":0},null,null,null,{"$f":"IF(AND(R19>0,R20>0),IF(OR(R19>10,R19<0,R20>10,R20<0),\"Fehler\",IF(ABS(P19)-ABS(Q19)-(R19+R20)/2+10>0,IF(P19<0,-(ABS(P19)-ABS(Q19)-(R19+R20)/2+10),P19-ABS(Q19)-(R19+R20)/2+10),0)),0)","v":0},null,null,null,{"$f":"IF(AND(V19>0,V20>0),IF(OR(V19>10,V19<0,V20>10,V20<0),\"Fehler\",IF(ABS(T19)-ABS(U19)-(V19+V20)/2+10>0,IF(T19<0,-(ABS(T19)-ABS(U19)-(V19+V20)/2+10),T19-ABS(U19)-(V19+V20)/2+10),0)),0)","v":0},null,null,null,{"$f":"IF(AND(Z19>0,Z20>0),IF(OR(Z19>10,Z19<0,Z20>10,Z20<0),\"Fehler\",IF(ABS(X19)-ABS(Y19)-(Z19+Z20)/2+10>0,IF(X19<0,-(ABS(X19)-ABS(Y19)-(Z19+Z20)/2+10),X19-ABS(Y19)-(Z19+Z20)/2+10),0)),0)","v":0},{"$f":"ABS(G19)+ABS(K19)+ABS(O19)+ABS(S19)+ABS(W19)+ABS(AA19)","v":0}]
[]
[null,{"$f":"IF(A21>0,B19,\"\")","v":""},{"$f":"IF(A21<>\"\", VLOOKUP(A21,'Wertungszettel M9'!A$7:B$36,2,0),\"\")","v":""},null,null,null,{"$f":"IF(AND(F21>0,F22>0),IF(OR(F21>10,F21<0,F22>10,F22<0),\"Fehler\",IF(ABS(D21)-ABS(E21)-(F21+F22)/2+10>0,IF(D21<0,-(ABS(D21)-ABS(E21)-(F21+F22)/2+10),D21-ABS(E21)-(F21+F22)/2+10),0)),0)","v":0},null,null,null,{"$f":"IF(AND(J21>0,J22>0),IF(OR(J21>10,J21<0,J22>10,J22<0),\"Fehler\",IF(ABS(H21)-ABS(I21)-(J21+J22)/2+10>0,IF(H21<0,-(ABS(H21)-ABS(I21)-(J21+J22)/2+10),H21-ABS(I21)-(J21+J22)/2+10),0)),0)","v":0},null,null,null,{"$f":"IF(AND(N21>0,N22>0),IF(OR(N21>10,N21<0,N22>10,N22<0),\"Fehler\",IF(ABS(L21)-ABS(M21)-(N21+N22)/2+10>0,IF(L21<0,-(ABS(L21)-ABS(M21)-(N21+N22)/2+10),L21-ABS(M21)-(N21+N22)/2+10),0)),0)","v":0},null,null,null,{"$f":"IF(AND(R21>0,R22>0),IF(OR(R21>10,R21<0,R22>10,R22<0),\"Fehler\",IF(ABS(P21)-ABS(Q21)-(R21+R22)/2+10>0,IF(P21<0,-(ABS(P21)-ABS(Q21)-(R21+R22)/2+10),P21-ABS(Q21)-(R21+R22)/2+10),0)),0)","v":0},null,null,null,{"$f":"IF(AND(V21>0,V22>0),IF(OR(V21>10,V21<0,V22>10,V22<0),\"Fehler\",IF(ABS(T21)-ABS(U21)-(V21+V22)/2+10>0,IF(T21<0,-(ABS(T21)-ABS(U21)-(V21+V22)/2+10),T21-ABS(U21)-(V21+V22)/2+10),0)),0)","v":0},null,null,null,{"$f":"IF(AND(Z21>0,Z22>0),IF(OR(Z21>10,Z21<0,Z22>10,Z22<0),\"Fehler\",IF(ABS(X21)-ABS(Y21)-(Z21+Z22)/2+10>0,IF(X21<0,-(ABS(X21)-ABS(Y21)-(Z21+Z22)/2+10),X21-ABS(Y21)-(Z21+Z22)/2+10),0)),0)","v":0},{"$f":"ABS(G21)+ABS(K21)+ABS(O21)+ABS(S21)+ABS(W21)+ABS(AA21)","v":0}]
[]
[null,{"$f":"IF(A23>0,B21,\"\")","v":""},{"$f":"IF(A23<>\"\", VLOOKUP(A23,'Wertungszettel M9'!A$7:B$36,2,0),\"\")","v":""},null,null,null,{"$f":"IF(AND(F23>0,F24>0),IF(OR(F23>10,F23<0,F24>10,F24<0),\"Fehler\",IF(ABS(D23)-ABS(E23)-(F23+F24)/2+10>0,IF(D23<0,-(ABS(D23)-ABS(E23)-(F23+F24)/2+10),D23-ABS(E23)-(F23+F24)/2+10),0)),0)","v":0},null,null,null,{"$f":"IF(AND(J23>0,J24>0),IF(OR(J23>10,J23<0,J24>10,J24<0),\"Fehler\",IF(ABS(H23)-ABS(I23)-(J23+J24)/2+10>0,IF(H23<0,-(ABS(H23)-ABS(I23)-(J23+J24)/2+10),H23-ABS(I23)-(J23+J24)/2+10),0)),0)","v":0},null,null,null,{"$f":"IF(AND(N23>0,N24>0),IF(OR(N23>10,N23<0,N24>10,N24<0),\"Fehler\",IF(ABS(L23)-ABS(M23)-(N23+N24)/2+10>0,IF(L23<0,-(ABS(L23)-ABS(M23)-(N23+N24)/2+10),L23-ABS(M23)-(N23+N24)/2+10),0)),0)","v":0},null,null,null,{"$f":"IF(AND(R23>0,R24>0),IF(OR(R23>10,R23<0,R24>10,R24<0),\"Fehler\",IF(ABS(P23)-ABS(Q23)-(R23+R24)/2+10>0,IF(P23<0,-(ABS(P23)-ABS(Q23)-(R23+R24)/2+10),P23-ABS(Q23)-(R23+R24)/2+10),0)),0)","v":0},null,null,null,{"$f":"IF(AND(V23>0,V24>0),IF(OR(V23>10,V23<0,V24>10,V24<0),\"Fehler\",IF(ABS(T23)-ABS(U23)-(V23+V24)/2+10>0,IF(T23<0,-(ABS(T23)-ABS(U23)-(V23+V24)/2+10),T23-ABS(U23)-(V23+V24)/2+10),0)),0)","v":0},null,null,null,{"$f":"IF(AND(Z23>0,Z24>0),IF(OR(Z23>10,Z23<0,Z24>10,Z24<0),\"Fehler\",IF(ABS(X23)-ABS(Y23)-(Z23+Z24)/2+10>0,IF(X23<0,-(ABS(X23)-ABS(Y23)-(Z23+Z24)/2+10),X23-ABS(Y23)-(Z23+Z24)/2+10),0)),0)","v":0},{"$f":"ABS(G23)+ABS(K23)+ABS(O23)+ABS(S23)+ABS(W23)+ABS(AA23)","v":0}]
[]
[null,{"$f":"IF(A25>0,B23,\"\")","v":""},{"$f":"IF(A25<>\"\", VLOOKUP(A25,'Wertungszettel M9'!A$7:B$36,2,0),\"\")","v":""},null,null,null,{"$f":"IF(AND(F25>0,F26>0),IF(OR(F25>10,F25<0,F26>10,F26<0),\"Fehler\",IF(ABS(D25)-ABS(E25)-(F25+F26)/2+10>0,IF(D25<0,-(ABS(D25)-ABS(E25)-(F25+F26)/2+10),D25-ABS(E25)-(F25+F26)/2+10),0)),0)","v":0},null,null,null,{"$f":"IF(AND(J25>0,J26>0),IF(OR(J25>10,J25<0,J26>10,J26<0),\"Fehler\",IF(ABS(H25)-ABS(I25)-(J25+J26)/2+10>0,IF(H25<0,-(ABS(H25)-ABS(I25)-(J25+J26)/2+10),H25-ABS(I25)-(J25+J26)/2+10),0)),0)","v":0},null,null,null,{"$f":"IF(AND(N25>0,N26>0),IF(OR(N25>10,N25<0,N26>10,N26<0),\"Fehler\",IF(ABS(L25)-ABS(M25)-(N25+N26)/2+10>0,IF(L25<0,-(ABS(L25)-ABS(M25)-(N25+N26)/2+10),L25-ABS(M25)-(N25+N26)/2+10),0)),0)","v":0},null,null,null,{"$f":"IF(AND(R25>0,R26>0),IF(OR(R25>10,R25<0,R26>10,R26<0),\"Fehler\",IF(ABS(P25)-ABS(Q25)-(R25+R26)/2+10>0,IF(P25<0,-(ABS(P25)-ABS(Q25)-(R25+R26)/2+10),P25-ABS(Q25)-(R25+R26)/2+10),0)),0)","v":0},null,null,null,{"$f":"IF(AND(V25>0,V26>0),IF(OR(V25>10,V25<0,V26>10,V26<0),\"Fehler\",IF(ABS(T25)-ABS(U25)-(V25+V26)/2+10>0,IF(T25<0,-(ABS(T25)-ABS(U25)-(V25+V26)/2+10),T25-ABS(U25)-(V25+V26)/2+10),0)),0)","v":0},null,null,null,{"$f":"IF(AND(Z25>0,Z26>0),IF(OR(Z25>10,Z25<0,Z26>10,Z26<0),\"Fehler\",IF(ABS(X25)-ABS(Y25)-(Z25+Z26)/2+10>0,IF(X25<0,-(ABS(X25)-ABS(Y25)-(Z25+Z26)/2+10),X25-ABS(Y25)-(Z25+Z26)/2+10),0)),0)","v":0},{"$f":"ABS(G25)+ABS(K25)+ABS(O25)+ABS(S25)+ABS(W25)+ABS(AA25)","v":0}]
[]
[null,{"$f":"IF(A27>0,B25,\"\")","v":""},{"$f":"IF(A27<>\"\", VLOOKUP(A27,'Wertungszettel M9'!A$7:B$36,2,0),\"\")","v":""},null,null,null,{"$f":"IF(AND(F27>0,F28>0),IF(OR(F27>10,F27<0,F28>10,F28<0),\"Fehler\",IF(ABS(D27)-ABS(E27)-(F27+F28)/2+10>0,IF(D27<0,-(ABS(D27)-ABS(E27)-(F27+F28)/2+10),D27-ABS(E27)-(F27+F28)/2+10),0)),0)","v":0},null,null,null,{"$f":"IF(AND(J27>0,J28>0),IF(OR(J27>10,J27<0,J28>10,J28<0),\"Fehler\",IF(ABS(H27)-ABS(I27)-(J27+J28)/2+10>0,IF(H27<0,-(ABS(H27)-ABS(I27)-(J27+J28)/2+10),H27-ABS(I27)-(J27+J28)/2+10),0)),0)","v":0},null,null,null,{"$f":"IF(AND(N27>0,N28>0),IF(OR(N27>10,N27<0,N28>10,N28<0),\"Fehler\",IF(ABS(L27)-ABS(M27)-(N27+N28)/2+10>0,IF(L27<0,-(ABS(L27)-ABS(M27)-(N27+N28)/2+10),L27-ABS(M27)-(N27+N28)/2+10),0)),0)","v":0},null,null,null,{"$f":"IF(AND(R27>0,R28>0),IF(OR(R27>10,R27<0,R28>10,R28<0),\"Fehler\",IF(ABS(P27)-ABS(Q27)-(R27+R28)/2+10>0,IF(P27<0,-(ABS(P27)-ABS(Q27)-(R27+R28)/2+10),P27-ABS(Q27)-(R27+R28)/2+10),0)),0)","v":0},null,null,null,{"$f":"IF(AND(V27>0,V28>0),IF(OR(V27>10,V27<0,V28>10,V28<0),\"Fehler\",IF(ABS(T27)-ABS(U27)-(V27+V28)/2+10>0,IF(T27<0,-(ABS(T27)-ABS(U27)-(V27+V28)/2+10),T27-ABS(U27)-(V27+V28)/2+10),0)),0)","v":0},null,null,null,{"$f":"IF(AND(Z27>0,Z28>0),IF(OR(Z27>10,Z27<0,Z28>10,Z28<0),\"Fehler\",IF(ABS(X27)-ABS(Y27)-(Z27+Z28)/2+10>0,IF(X27<0,-(ABS(X27)-ABS(Y27)-(Z27+Z28)/2+10),X27-ABS(Y27)-(Z27+Z28)/2+10),0)),0)","v":0},{"$f":"ABS(G27)+ABS(K27)+ABS(O27)+ABS(S27)+ABS(W27)+ABS(AA27)","v":0}]
[]
[]
[null,null,null,null,null,null,{"$f":"SUM(LARGE(G9:G28,1),LARGE(G9:G28,2),LARGE(G9:G28,3))","v":0},null,null,null,{"$f":"SUM(LARGE(K9:K28,1),LARGE(K9:K28,2),LARGE(K9:K28,3))","v":0},null,null,null,{"$f":"SUM(LARGE(O9:O28,1),LARGE(O9:O28,2),LARGE(O9:O28,3))","v":0},null,null,null,{"$f":"SUM(LARGE(S9:S28,1),LARGE(S9:S28,2),LARGE(S9:S28,3))","v":0},null,null,null,{"$f":"SUM(LARGE(W9:W28,1),LARGE(W9:W28,2),LARGE(W9:W28,3))","v":0},null,null,null,{"$f":"SUM(LARGE(AA9:AA28,1),LARGE(AA9:AA28,2),LARGE(AA9:AA28,3))","v":0},{"$f":"SUM(G30,K30,O30,S30,W30,AA30)","v":0}]

{"sheet":"M10","index":13,"n_rows":30,"n_cols":28,"rows_kept":30,"cut":false,"hidden":true,"merged":[[26,27,27,27],[26,16,27,16],[26,18,27,18],[26,19,27,19],[26,20,27,20],[26,22,27,22],[26,23,27,23],[26,8,27,8],[26,10,27,10],[26,11,27,11],[26,12,27,12],[26,14,27,14],[26,15,27,15],[24,24,25,24],[24,26,25,26],[24,27,25,27],[26,0,27,0],[26,1,27,1],[26,2,27,2],[26,3,27,3],[26,4,27,4],[26,6,27,6],[26,7,27,7],[24,16,25,16],[24,18,25,18],[24,19,25,19],[24,20,25,20],[24,22,25,22],[24,23,25,23],[24,8,25,8],[24,10,25,10],[24,11,25,11],[24,12,25,12],[24,14,25,14],[24,15,25,15],[26,24,27,24],[26,26,27,26],[22,20,23,20],[22,22,23,22],[22,23,23,23],[22,8,23,8],[22,10,23,10],[22,11,23,11],[22,12,23,12],[22,14,23,14],[22,15,23,15],[24,0,25,0],[24,1,25,1],[24,2,25,2],[24,3,25,3],[24,4,25,4],[24,6,25,6],[24,7,25,7],[22,16,23,16],[22,18,23,18],[20,27,21,27],[22,0,23,0],[22,1,23,1],[22,2,23,2],[22,3,23,3],[22,4,23,4],[22,6,23,6],[22,7,23,7],[20,16,21,16],[20,18,21,18],[20,19,21,19],[20,20,21,20],[20,22,21,22],[20,23,21,23],[20,8,21,8],[20,10,21,10],[20,11,21,11],[20,12,21,12],[20,14,21,14],[20,15,21,15],[22,24,23,24],[22,26,23,26],[22,27,23,27],[22,19,23,19],[18,24,19,24],[18,26,19,26],[18,27,19,27],[20,0,21,0],[20,1,21,1],[20,2,21,2],[20,3,21,3],[20,4,21,4],[20,6,21,6],[20,7,21,7],[18,16,19,16],[18,18,19,18],[18,19,19,19],[18,20,19,20],[18,22,19,22],[18,23,19,23],[18,8,19,8],[18,10,19,10],[18,11,19,11],[18,12,19,12],[18,14,19,14],[18,15,19,15],[20,24,21,24],[20,26,21,26],[16,20,17,20],[16,22,17,22],[16,23,17,23],[16,8,17,8],[16,10,17,10],[16,11,17,11],[16,12,17,12],[16,14,17,14],[16,15,17,15],[18,0,19,0],[18,1,19,1],[18,2,19,2],[18,3,19,3],[18,4,19,4],[18,6,19,6],[18,7,19,7],[16,16,17,16],[16,18,17,18],[14,27,15,27],[16,0,17,0],[16,1,17,1],[16,2,17,2],[16,3,17,3],[16,4,17,4],[16,6,17,6],[16,7,17,7],[14,16,15,16],[14,18,15,18],[14,19,15,19],[14,20,15,20],[14,22,15,22],[14,23,15,23],[14,8,15,8],[14,10,15,10],[14,11,15,11],[14,12,15,12],[14,14,15,14],[14,15,15,15],[16,24,17,24],[16,26,17,26],[16,27,17,27],[16,19,17,19],[12,24,13,24],[12,26,13,26],[12,27,13,27],[14,0,15,0],[14,1,15,1],[14,2,15,2],[14,3,15,3],[14,4,15,4],[14,6,15,6],[14,7,15,7],[12,16,13,16],[12,18,13,18],[12,19,13,19],[12,20,13,20],[12,22,13,22],[12,23,13,23],[12,8,13,8],[12,10,13,10],[12,11,13,11],[12,12,13,12],[12,14,13,14],[12,15,13,15],[14,24,15,24],[14,26,15,26],[10,19,11,19],[10,20,11,20],[10,22,11,22],[10,7,11,7],[10,8,11,8],[10,10,11,10],[10,11,11,11],[10,12,11,12],[10,14,11,14],[12,0,13,0],[12,1,13,1],[12,2,13,2],[12,3,13,3],[12,4,13,4],[12,6,13,6],[12,7,13,7],[10,16,11,16],[10,18,11,18],[10,15,11,15],[8,27,9,27],[10,0,11,0],[10,1,11,1],[10,2,11,2],[10,3,11,3],[10,4,11,4],[10,6,11,6],[8,15,9,15],[8,16,9,16],[8,18,9,18],[8,19,9,19],[8,20,9,20],[10,23,11,23],[8,7,9,7],[8,8,9,8],[8,10,9,10],[8,11,9,11],[8,12,9,12],[8,14,9,14],[8,0,9,0],[8,1,9,1],[10,24,11,24],[10,26,11,26],[10,27,11,27],[6,23,6,26],[0,12,0,13],[2,0,2,1],[2,5,2,7],[2,12,2,13],[8,2,9,2],[8,3,9,3],[8,4,9,4],[8,6,9,6],[6,3,6,6],[6,7,6,10],[6,11,6,14],[6,15,6,18],[6,19,6,22],[8,23,9,23],[8,24,9,24],[8,26,9,26],[8,22,9,22],[2,14,2,16],[0,14,0,16],[4,14,4,16]]}
["Wettkampfbogen",null,null,null,null,null,null,null,null,null,null,null,"Datum:",null,{"$f":"'INFO Blatt'!B13","v":"2018-03-03"}]
[]
[null,null,null,null,null,null,null,null,null,null,null,null,"Ort:",null,{"$f":"'INFO Blatt'!B11","v":"Hehlen"}]
[]
[null,null,null,null,null,null,null,null,null,null,null,null,null,"Liga:",{"$f":"'INFO Blatt'!B7","v":"Schülerliga Süd"}]
[]
["Name","Verein","Jg","Boden",null,null,null,"Pferd",null,null,null,"Ringe",null,null,null,"Sprung",null,null,null,"Barren",null,null,null,"Reck",null,null,null,"Ges."]
[null,null,null,"D-Note","Abzug OK","E- Abzug","Note","D-Note","Abzug OK","E- Abzug","Note","D-Note","Abzug OK","E-Abzug","Note","D-Note","Abzug OK","E-Abzug","Note","D-Note","Abzug OK","E-Abzug","Note","D-Note","Abzug OK","E-Abzug","Note"]
[null,{"$f":"Formeln!A14","v":"M10"},{"$f":"IF(A9<>\"\", VLOOKUP(A9,'Wertungszettel M10'!A$7:B$36,2,0),\"\")","v":""},null,null,null,{"$f":"IF(AND(F9>0,F10>0),IF(OR(F9>10,F9<0,F10>10,F10<0),\"Fehler\",IF(ABS(D9)-ABS(E9)-(F9+F10)/2+10>0,IF(D9<0,-(ABS(D9)-ABS(E9)-(F9+F10)/2+10),D9-ABS(E9)-(F9+F10)/2+10),0)),0)","v":0},null,null,null,{"$f":"IF(AND(J9>0,J10>0),IF(OR(J9>10,J9<0,J10>10,J10<0),\"Fehler\",IF(ABS(H9)-ABS(I9)-(J9+J10)/2+10>0,IF(H9<0,-(ABS(H9)-ABS(I9)-(J9+J10)/2+10),H9-ABS(I9)-(J9+J10)/2+10),0)),0)","v":0},null,null,null,{"$f":"IF(AND(N9>0,N10>0),IF(OR(N9>10,N9<0,N10>10,N10<0),\"Fehler\",IF(ABS(L9)-ABS(M9)-(N9+N10)/2+10>0,IF(L9<0,-(ABS(L9)-ABS(M9)-(N9+N10)/2+10),L9-ABS(M9)-(N9+N10)/2+10),0)),0)","v":0},null,null,null,{"$f":"IF(AND(R9>0,R10>0),IF(OR(R9>10,R9<0,R10>10,R10<0),\"Fehler\",IF(ABS(P9)-ABS(Q9)-(R9+R10)/2+10>0,IF(P9<0,-(ABS(P9)-ABS(Q9)-(R9+R10)/2+10),P9-ABS(Q9)-(R9+R10)/2+10),0)),0)","v":0},null,null,null,{"$f":"IF(AND(V9>0,V10>0),IF(OR(V9>10,V9<0,V10>10,V10<0),\"Fehler\",IF(ABS(T9)-ABS(U9)-(V9+V10)/2+10>0,IF(T9<0,-(ABS(T9)-ABS(U9)-(V9+V10)/2+10),T9-ABS(U9)-(V9+V10)/2+10),0)),0)","v":0},null,null,null,{"$f":"IF(AND(Z9>0,Z10>0),IF(OR(Z9>10,Z9<0,Z10>10,Z10<0),\"Fehler\",IF(ABS(X9)-ABS(Y9)-(Z9+Z10)/2+10>0,IF(X9<0,-(ABS(X9)-ABS(Y9)-(Z9+Z10)/2+10),X9-ABS(Y9)-(Z9+Z10)/2+10),0)),0)","v":0},{"$f":"ABS(G9)+ABS(K9)+ABS(O9)+ABS(S9)+ABS(W9)+ABS(AA9)","v":0}]
[]
[null,{"$f":"IF(A11>0,B9,\"\")","v":""},{"$f":"IF(A11<>\"\", VLOOKUP(A11,'Wertungszettel M10'!A$7:B$36,2),\"\")","v":""},null,null,null,{"$f":"IF(AND(F11>0,F12>0),IF(OR(F11>10,F11<0,F12>10,F12<0),\"Fehler\",IF(ABS(D11)-ABS(E11)-(F11+F12)/2+10>0,IF(D11<0,-(ABS(D11)-ABS(E11)-(F11+F12)/2+10),D11-ABS(E11)-(F11+F12)/2+10),0)),0)","v":0},null,null,null,{"$f":"IF(AND(J11>0,J12>0),IF(OR(J11>10,J11<0,J12>10,J12<0),\"Fehler\",IF(ABS(H11)-ABS(I11)-(J11+J12)/2+10>0,IF(H11<0,-(ABS(H11)-ABS(I11)-(J11+J12)/2+10),H11-ABS(I11)-(J11+J12)/2+10),0)),0)","v":0},null,null,null,{"$f":"IF(AND(N11>0,N12>0),IF(OR(N11>10,N11<0,N12>10,N12<0),\"Fehler\",IF(ABS(L11)-ABS(M11)-(N11+N12)/2+10>0,IF(L11<0,-(ABS(L11)-ABS(M11)-(N11+N12)/2+10),L11-ABS(M11)-(N11+N12)/2+10),0)),0)","v":0},null,null,null,{"$f":"IF(AND(R11>0,R12>0),IF(OR(R11>10,R11<0,R12>10,R12<0),\"Fehler\",IF(ABS(P11)-ABS(Q11)-(R11+R12)/2+10>0,IF(P11<0,-(ABS(P11)-ABS(Q11)-(R11+R12)/2+10),P11-ABS(Q11)-(R11+R12)/2+10),0)),0)","v":0},null,null,null,{"$f":"IF(AND(V11>0,V12>0),IF(OR(V11>10,V11<0,V12>10,V12<0),\"Fehler\",IF(ABS(T11)-ABS(U11)-(V11+V12)/2+10>0,IF(T11<0,-(ABS(T11)-ABS(U11)-(V11+V12)/2+10),T11-ABS(U11)-(V11+V12)/2+10),0)),0)","v":0},null,null,null,{"$f":"IF(AND(Z11>0,Z12>0),IF(OR(Z11>10,Z11<0,Z12>10,Z12<0),\"Fehler\",IF(ABS(X11)-ABS(Y11)-(Z11+Z12)/2+10>0,IF(X11<0,-(ABS(X11)-ABS(Y11)-(Z11+Z12)/2+10),X11-ABS(Y11)-(Z11+Z12)/2+10),0)),0)","v":0},{"$f":"ABS(G11)+ABS(K11)+ABS(O11)+ABS(S11)+ABS(W11)+ABS(AA11)","v":0}]
[]
[null,{"$f":"IF(A13>0,B11,\"\")","v":""},{"$f":"IF(A13<>\"\", VLOOKUP(A13,'Wertungszettel M10'!A$7:B$36,2),\"\")","v":""},null,null,null,{"$f":"IF(AND(F13>0,F14>0),IF(OR(F13>10,F13<0,F14>10,F14<0),\"Fehler\",IF(ABS(D13)-ABS(E13)-(F13+F14)/2+10>0,IF(D13<0,-(ABS(D13)-ABS(E13)-(F13+F14)/2+10),D13-ABS(E13)-(F13+F14)/2+10),0)),0)","v":0},null,null,null,{"$f":"IF(AND(J13>0,J14>0),IF(OR(J13>10,J13<0,J14>10,J14<0),\"Fehler\",IF(ABS(H13)-ABS(I13)-(J13+J14)/2+10>0,IF(H13<0,-(ABS(H13)-ABS(I13)-(J13+J14)/2+10),H13-ABS(I13)-(J13+J14)/2+10),0)),0)","v":0},null,null,null,{"$f":"IF(AND(N13>0,N14>0),IF(OR(N13>10,N13<0,N14>10,N14<0),\"Fehler\",IF(ABS(L13)-ABS(M13)-(N13+N14)/2+10>0,IF(L13<0,-(ABS(L13)-ABS(M13)-(N13+N14)/2+10),L13-ABS(M13)-(N13+N14)/2+10),0)),0)","v":0},null,null,null,{"$f":"IF(AND(R13>0,R14>0),IF(OR(R13>10,R13<0,R14>10,R14<0),\"Fehler\",IF(ABS(P13)-ABS(Q13)-(R13+R14)/2+10>0,IF(P13<0,-(ABS(P13)-ABS(Q13)-(R13+R14)/2+10),P13-ABS(Q13)-(R13+R14)/2+10),0)),0)","v":0},null,null,null,{"$f":"IF(AND(V13>0,V14>0),IF(OR(V13>10,V13<0,V14>10,V14<0),\"Fehler\",IF(ABS(T13)-ABS(U13)-(V13+V14)/2+10>0,IF(T13<0,-(ABS(T13)-ABS(U13)-(V13+V14)/2+10),T13-ABS(U13)-(V13+V14)/2+10),0)),0)","v":0},null,null,null,{"$f":"IF(AND(Z13>0,Z14>0),IF(OR(Z13>10,Z13<0,Z14>10,Z14<0),\"Fehler\",IF(ABS(X13)-ABS(Y13)-(Z13+Z14)/2+10>0,IF(X13<0,-(ABS(X13)-ABS(Y13)-(Z13+Z14)/2+10),X13-ABS(Y13)-(Z13+Z14)/2+10),0)),0)","v":0},{"$f":"ABS(G13)+ABS(K13)+ABS(O13)+ABS(S13)+ABS(W13)+ABS(AA13)","v":0}]
[]
[null,{"$f":"IF(A15>0,B13,\"\")","v":""},{"$f":"IF(A15<>\"\", VLOOKUP(A15,'Wertungszettel M10'!A$7:B$36,2),\"\")","v":""},null,null,null,{"$f":"IF(AND(F15>0,F16>0),IF(OR(F15>10,F15<0,F16>10,F16<0),\"Fehler\",IF(ABS(D15)-ABS(E15)-(F15+F16)/2+10>0,IF(D15<0,-(ABS(D15)-ABS(E15)-(F15+F16)/2+10),D15-ABS(E15)-(F15+F16)/2+10),0)),0)","v":0},null,null,null,{"$f":"IF(AND(J15>0,J16>0),IF(OR(J15>10,J15<0,J16>10,J16<0),\"Fehler\",IF(ABS(H15)-ABS(I15)-(J15+J16)/2+10>0,IF(H15<0,-(ABS(H15)-ABS(I15)-(J15+J16)/2+10),H15-ABS(I15)-(J15+J16)/2+10),0)),0)","v":0},null,null,null,{"$f":"IF(AND(N15>0,N16>0),IF(OR(N15>10,N15<0,N16>10,N16<0),\"Fehler\",IF(ABS(L15)-ABS(M15)-(N15+N16)/2+10>0,IF(L15<0,-(ABS(L15)-ABS(M15)-(N15+N16)/2+10),L15-ABS(M15)-(N15+N16)/2+10),0)),0)","v":0},null,null,null,{"$f":"IF(AND(R15>0,R16>0),IF(OR(R15>10,R15<0,R16>10,R16<0),\"Fehler\",IF(ABS(P15)-ABS(Q15)-(R15+R16)/2+10>0,IF(P15<0,-(ABS(P15)-ABS(Q15)-(R15+R16)/2+10),P15-ABS(Q15)-(R15+R16)/2+10),0)),0)","v":0},null,null,null,{"$f":"IF(AND(V15>0,V16>0),IF(OR(V15>10,V15<0,V16>10,V16<0),\"Fehler\",IF(ABS(T15)-ABS(U15)-(V15+V16)/2+10>0,IF(T15<0,-(ABS(T15)-ABS(U15)-(V15+V16)/2+10),T15-ABS(U15)-(V15+V16)/2+10),0)),0)","v":0},null,null,null,{"$f":"IF(AND(Z15>0,Z16>0),IF(OR(Z15>10,Z15<0,Z16>10,Z16<0),\"Fehler\",IF(ABS(X15)-ABS(Y15)-(Z15+Z16)/2+10>0,IF(X15<0,-(ABS(X15)-ABS(Y15)-(Z15+Z16)/2+10),X15-ABS(Y15)-(Z15+Z16)/2+10),0)),0)","v":0},{"$f":"ABS(G15)+ABS(K15)+ABS(O15)+ABS(S15)+ABS(W15)+ABS(AA15)","v":0}]
[]
[null,{"$f":"IF(A17>0,B15,\"\")","v":""},{"$f":"IF(A17<>\"\", VLOOKUP(A17,'Wertungszettel M10'!A$7:B$36,2),\"\")","v":""},null,null,null,{"$f":"IF(AND(F17>0,F18>0),IF(OR(F17>10,F17<0,F18>10,F18<0),\"Fehler\",IF(ABS(D17)-ABS(E17)-(F17+F18)/2+10>0,IF(D17<0,-(ABS(D17)-ABS(E17)-(F17+F18)/2+10),D17-ABS(E17)-(F17+F18)/2+10),0)),0)","v":0},null,null,null,{"$f":"IF(AND(J17>0,J18>0),IF(OR(J17>10,J17<0,J18>10,J18<0),\"Fehler\",IF(ABS(H17)-ABS(I17)-(J17+J18)/2+10>0,IF(H17<0,-(ABS(H17)-ABS(I17)-(J17+J18)/2+10),H17-ABS(I17)-(J17+J18)/2+10),0)),0)","v":0},null,null,null,{"$f":"IF(AND(N17>0,N18>0),IF(OR(N17>10,N17<0,N18>10,N18<0),\"Fehler\",IF(ABS(L17)-ABS(M17)-(N17+N18)/2+10>0,IF(L17<0,-(ABS(L17)-ABS(M17)-(N17+N18)/2+10),L17-ABS(M17)-(N17+N18)/2+10),0)),0)","v":0},null,null,null,{"$f":"IF(AND(R17>0,R18>0),IF(OR(R17>10,R17<0,R18>10,R18<0),\"Fehler\",IF(ABS(P17)-ABS(Q17)-(R17+R18)/2+10>0,IF(P17<0,-(ABS(P17)-ABS(Q17)-(R17+R18)/2+10),P17-ABS(Q17)-(R17+R18)/2+10),0)),0)","v":0},null,null,null,{"$f":"IF(AND(V17>0,V18>0),IF(OR(V17>10,V17<0,V18>10,V18<0),\"Fehler\",IF(ABS(T17)-ABS(U17)-(V17+V18)/2+10>0,IF(T17<0,-(ABS(T17)-ABS(U17)-(V17+V18)/2+10),T17-ABS(U17)-(V17+V18)/2+10),0)),0)","v":0},null,null,null,{"$f":"IF(AND(Z17>0,Z18>0),IF(OR(Z17>10,Z17<0,Z18>10,Z18<0),\"Fehler\",IF(ABS(X17)-ABS(Y17)-(Z17+Z18)/2+10>0,IF(X17<0,-(ABS(X17)-ABS(Y17)-(Z17+Z18)/2+10),X17-ABS(Y17)-(Z17+Z18)/2+10),0)),0)","v":0},{"$f":"ABS(G17)+ABS(K17)+ABS(O17)+ABS(S17)+ABS(W17)+ABS(AA17)","v":0}]
[]
[null,{"$f":"IF(A19>0,B17,\"\")","v":""},{"$f":"IF(A19<>\"\", VLOOKUP(A19,'Wertungszettel M10'!A$7:B$36,2),\"\")","v":""},null,null,null,{"$f":"IF(AND(F19>0,F20>0),IF(OR(F19>10,F19<0,F20>10,F20<0),\"Fehler\",IF(ABS(D19)-ABS(E19)-(F19+F20)/2+10>0,IF(D19<0,-(ABS(D19)-ABS(E19)-(F19+F20)/2+10),D19-ABS(E19)-(F19+F20)/2+10),0)),0)","v":0},null,null,null,{"$f":"IF(AND(J19>0,J20>0),IF(OR(J19>10,J19<0,J20>10,J20<0),\"Fehler\",IF(ABS(H19)-ABS(I19)-(J19+J20)/2+10>0,IF(H19<0,-(ABS(H19)-ABS(I19)-(J19+J20)/2+10),H19-ABS(I19)-(J19+J20)/2+10),0)),0)","v":0},null,null,null,{"$f":"IF(AND(N19>0,N20>0),IF(OR(N19>10,N19<0,N20>10,N20<0),\"Fehler\",IF(ABS(L19)-ABS(M19)-(N19+N20)/2+10>0,IF(L19<0,-(ABS(L19)-ABS(M19)-(N19+N20)/2+10),L19-ABS(M19)-(N19+N20)/2+10),0)),0)","v":0},null,null,null,{"$f":"IF(AND(R19>0,R20>0),IF(OR(R19>10,R19<0,R20>10,R20<0),\"Fehler\",IF(ABS(P19)-ABS(Q19)-(R19+R20)/2+10>0,IF(P19<0,-(ABS(P19)-ABS(Q19)-(R19+R20)/2+10),P19-ABS(Q19)-(R19+R20)/2+10),0)),0)","v":0},null,null,null,{"$f":"IF(AND(V19>0,V20>0),IF(OR(V19>10,V19<0,V20>10,V20<0),\"Fehler\",IF(ABS(T19)-ABS(U19)-(V19+V20)/2+10>0,IF(T19<0,-(ABS(T19)-ABS(U19)-(V19+V20)/2+10),T19-ABS(U19)-(V19+V20)/2+10),0)),0)","v":0},null,null,null,{"$f":"IF(AND(Z19>0,Z20>0),IF(OR(Z19>10,Z19<0,Z20>10,Z20<0),\"Fehler\",IF(ABS(X19)-ABS(Y19)-(Z19+Z20)/2+10>0,IF(X19<0,-(ABS(X19)-ABS(Y19)-(Z19+Z20)/2+10),X19-ABS(Y19)-(Z19+Z20)/2+10),0)),0)","v":0},{"$f":"ABS(G19)+ABS(K19)+ABS(O19)+ABS(S19)+ABS(W19)+ABS(AA19)","v":0}]
[]
[null,{"$f":"IF(A21>0,B19,\"\")","v":""},{"$f":"IF(A21<>\"\", VLOOKUP(A21,'Wertungszettel M10'!A$7:B$36,2),\"\")","v":""},null,null,null,{"$f":"IF(AND(F21>0,F22>0),IF(OR(F21>10,F21<0,F22>10,F22<0),\"Fehler\",IF(ABS(D21)-ABS(E21)-(F21+F22)/2+10>0,IF(D21<0,-(ABS(D21)-ABS(E21)-(F21+F22)/2+10),D21-ABS(E21)-(F21+F22)/2+10),0)),0)","v":0},null,null,null,{"$f":"IF(AND(J21>0,J22>0),IF(OR(J21>10,J21<0,J22>10,J22<0),\"Fehler\",IF(ABS(H21)-ABS(I21)-(J21+J22)/2+10>0,IF(H21<0,-(ABS(H21)-ABS(I21)-(J21+J22)/2+10),H21-ABS(I21)-(J21+J22)/2+10),0)),0)","v":0},null,null,null,{"$f":"IF(AND(N21>0,N22>0),IF(OR(N21>10,N21<0,N22>10,N22<0),\"Fehler\",IF(ABS(L21)-ABS(M21)-(N21+N22)/2+10>0,IF(L21<0,-(ABS(L21)-ABS(M21)-(N21+N22)/2+10),L21-ABS(M21)-(N21+N22)/2+10),0)),0)","v":0},null,null,null,{"$f":"IF(AND(R21>0,R22>0),IF(OR(R21>10,R21<0,R22>10,R22<0),\"Fehler\",IF(ABS(P21)-ABS(Q21)-(R21+R22)/2+10>0,IF(P21<0,-(ABS(P21)-ABS(Q21)-(R21+R22)/2+10),P21-ABS(Q21)-(R21+R22)/2+10),0)),0)","v":0},null,null,null,{"$f":"IF(AND(V21>0,V22>0),IF(OR(V21>10,V21<0,V22>10,V22<0),\"Fehler\",IF(ABS(T21)-ABS(U21)-(V21+V22)/2+10>0,IF(T21<0,-(ABS(T21)-ABS(U21)-(V21+V22)/2+10),T21-ABS(U21)-(V21+V22)/2+10),0)),0)","v":0},null,null,null,{"$f":"IF(AND(Z21>0,Z22>0),IF(OR(Z21>10,Z21<0,Z22>10,Z22<0),\"Fehler\",IF(ABS(X21)-ABS(Y21)-(Z21+Z22)/2+10>0,IF(X21<0,-(ABS(X21)-ABS(Y21)-(Z21+Z22)/2+10),X21-ABS(Y21)-(Z21+Z22)/2+10),0)),0)","v":0},{"$f":"ABS(G21)+ABS(K21)+ABS(O21)+ABS(S21)+ABS(W21)+ABS(AA21)","v":0}]
[]
[null,{"$f":"IF(A23>0,B21,\"\")","v":""},{"$f":"IF(A23<>\"\", VLOOKUP(A23,'Wertungszettel M10'!A$7:B$36,2),\"\")","v":""},null,null,null,{"$f":"IF(AND(F23>0,F24>0),IF(OR(F23>10,F23<0,F24>10,F24<0),\"Fehler\",IF(ABS(D23)-ABS(E23)-(F23+F24)/2+10>0,IF(D23<0,-(ABS(D23)-ABS(E23)-(F23+F24)/2+10),D23-ABS(E23)-(F23+F24)/2+10),0)),0)","v":0},null,null,null,{"$f":"IF(AND(J23>0,J24>0),IF(OR(J23>10,J23<0,J24>10,J24<0),\"Fehler\",IF(ABS(H23)-ABS(I23)-(J23+J24)/2+10>0,IF(H23<0,-(ABS(H23)-ABS(I23)-(J23+J24)/2+10),H23-ABS(I23)-(J23+J24)/2+10),0)),0)","v":0},null,null,null,{"$f":"IF(AND(N23>0,N24>0),IF(OR(N23>10,N23<0,N24>10,N24<0),\"Fehler\",IF(ABS(L23)-ABS(M23)-(N23+N24)/2+10>0,IF(L23<0,-(ABS(L23)-ABS(M23)-(N23+N24)/2+10),L23-ABS(M23)-(N23+N24)/2+10),0)),0)","v":0},null,null,null,{"$f":"IF(AND(R23>0,R24>0),IF(OR(R23>10,R23<0,R24>10,R24<0),\"Fehler\",IF(ABS(P23)-ABS(Q23)-(R23+R24)/2+10>0,IF(P23<0,-(ABS(P23)-ABS(Q23)-(R23+R24)/2+10),P23-ABS(Q23)-(R23+R24)/2+10),0)),0)","v":0},null,null,null,{"$f":"IF(AND(V23>0,V24>0),IF(OR(V23>10,V23<0,V24>10,V24<0),\"Fehler\",IF(ABS(T23)-ABS(U23)-(V23+V24)/2+10>0,IF(T23<0,-(ABS(T23)-ABS(U23)-(V23+V24)/2+10),T23-ABS(U23)-(V23+V24)/2+10),0)),0)","v":0},null,null,null,{"$f":"IF(AND(Z23>0,Z24>0),IF(OR(Z23>10,Z23<0,Z24>10,Z24<0),\"Fehler\",IF(ABS(X23)-ABS(Y23)-(Z23+Z24)/2+10>0,IF(X23<0,-(ABS(X23)-ABS(Y23)-(Z23+Z24)/2+10),X23-ABS(Y23)-(Z23+Z24)/2+10),0)),0)","v":0},{"$f":"ABS(G23)+ABS(K23)+ABS(O23)+ABS(S23)+ABS(W23)+ABS(AA23)","v":0}]
[]
[null,{"$f":"IF(A25>0,B23,\"\")","v":""},{"$f":"IF(A25<>\"\", VLOOKUP(A25,'Wertungszettel M10'!A$7:B$36,2),\"\")","v":""},null,null,null,{"$f":"IF(AND(F25>0,F26>0),IF(OR(F25>10,F25<0,F26>10,F26<0),\"Fehler\",IF(ABS(D25)-ABS(E25)-(F25+F26)/2+10>0,IF(D25<0,-(ABS(D25)-ABS(E25)-(F25+F26)/2+10),D25-ABS(E25)-(F25+F26)/2+10),0)),0)","v":0},null,null,null,{"$f":"IF(AND(J25>0,J26>0),IF(OR(J25>10,J25<0,J26>10,J26<0),\"Fehler\",IF(ABS(H25)-ABS(I25)-(J25+J26)/2+10>0,IF(H25<0,-(ABS(H25)-ABS(I25)-(J25+J26)/2+10),H25-ABS(I25)-(J25+J26)/2+10),0)),0)","v":0},null,null,null,{"$f":"IF(AND(N25>0,N26>0),IF(OR(N25>10,N25<0,N26>10,N26<0),\"Fehler\",IF(ABS(L25)-ABS(M25)-(N25+N26)/2+10>0,IF(L25<0,-(ABS(L25)-ABS(M25)-(N25+N26)/2+10),L25-ABS(M25)-(N25+N26)/2+10),0)),0)","v":0},null,null,null,{"$f":"IF(AND(R25>0,R26>0),IF(OR(R25>10,R25<0,R26>10,R26<0),\"Fehler\",IF(ABS(P25)-ABS(Q25)-(R25+R26)/2+10>0,IF(P25<0,-(ABS(P25)-ABS(Q25)-(R25+R26)/2+10),P25-ABS(Q25)-(R25+R26)/2+10),0)),0)","v":0},null,null,null,{"$f":"IF(AND(V25>0,V26>0),IF(OR(V25>10,V25<0,V26>10,V26<0),\"Fehler\",IF(ABS(T25)-ABS(U25)-(V25+V26)/2+10>0,IF(T25<0,-(ABS(T25)-ABS(U25)-(V25+V26)/2+10),T25-ABS(U25)-(V25+V26)/2+10),0)),0)","v":0},null,null,null,{"$f":"IF(AND(Z25>0,Z26>0),IF(OR(Z25>10,Z25<0,Z26>10,Z26<0),\"Fehler\",IF(ABS(X25)-ABS(Y25)-(Z25+Z26)/2+10>0,IF(X25<0,-(ABS(X25)-ABS(Y25)-(Z25+Z26)/2+10),X25-ABS(Y25)-(Z25+Z26)/2+10),0)),0)","v":0},{"$f":"ABS(G25)+ABS(K25)+ABS(O25)+ABS(S25)+ABS(W25)+ABS(AA25)","v":0}]
[]
[null,{"$f":"IF(A27>0,B25,\"\")","v":""},{"$f":"IF(A27<>\"\", VLOOKUP(A27,'Wertungszettel M10'!A$7:B$36,2),\"\")","v":""},null,null,null,{"$f":"IF(AND(F27>0,F28>0),IF(OR(F27>10,F27<0,F28>10,F28<0),\"Fehler\",IF(ABS(D27)-ABS(E27)-(F27+F28)/2+10>0,IF(D27<0,-(ABS(D27)-ABS(E27)-(F27+F28)/2+10),D27-ABS(E27)-(F27+F28)/2+10),0)),0)","v":0},null,null,null,{"$f":"IF(AND(J27>0,J28>0),IF(OR(J27>10,J27<0,J28>10,J28<0),\"Fehler\",IF(ABS(H27)-ABS(I27)-(J27+J28)/2+10>0,IF(H27<0,-(ABS(H27)-ABS(I27)-(J27+J28)/2+10),H27-ABS(I27)-(J27+J28)/2+10),0)),0)","v":0},null,null,null,{"$f":"IF(AND(N27>0,N28>0),IF(OR(N27>10,N27<0,N28>10,N28<0),\"Fehler\",IF(ABS(L27)-ABS(M27)-(N27+N28)/2+10>0,IF(L27<0,-(ABS(L27)-ABS(M27)-(N27+N28)/2+10),L27-ABS(M27)-(N27+N28)/2+10),0)),0)","v":0},null,null,null,{"$f":"IF(AND(R27>0,R28>0),IF(OR(R27>10,R27<0,R28>10,R28<0),\"Fehler\",IF(ABS(P27)-ABS(Q27)-(R27+R28)/2+10>0,IF(P27<0,-(ABS(P27)-ABS(Q27)-(R27+R28)/2+10),P27-ABS(Q27)-(R27+R28)/2+10),0)),0)","v":0},null,null,null,{"$f":"IF(AND(V27>0,V28>0),IF(OR(V27>10,V27<0,V28>10,V28<0),\"Fehler\",IF(ABS(T27)-ABS(U27)-(V27+V28)/2+10>0,IF(T27<0,-(ABS(T27)-ABS(U27)-(V27+V28)/2+10),T27-ABS(U27)-(V27+V28)/2+10),0)),0)","v":0},null,null,null,{"$f":"IF(AND(Z27>0,Z28>0),IF(OR(Z27>10,Z27<0,Z28>10,Z28<0),\"Fehler\",IF(ABS(X27)-ABS(Y27)-(Z27+Z28)/2+10>0,IF(X27<0,-(ABS(X27)-ABS(Y27)-(Z27+Z28)/2+10),X27-ABS(Y27)-(Z27+Z28)/2+10),0)),0)","v":0},{"$f":"ABS(G27)+ABS(K27)+ABS(O27)+ABS(S27)+ABS(W27)+ABS(AA27)","v":0}]
[]
[]
[null,null,null,null,null,null,{"$f":"SUM(LARGE(G9:G28,1),LARGE(G9:G28,2),LARGE(G9:G28,3))","v":0},null,null,null,{"$f":"SUM(LARGE(K9:K28,1),LARGE(K9:K28,2),LARGE(K9:K28,3))","v":0},null,null,null,{"$f":"SUM(LARGE(O9:O28,1),LARGE(O9:O28,2),LARGE(O9:O28,3))","v":0},null,null,null,{"$f":"SUM(LARGE(S9:S28,1),LARGE(S9:S28,2),LARGE(S9:S28,3))","v":0},null,null,null,{"$f":"SUM(LARGE(W9:W28,1),LARGE(W9:W28,2),LARGE(W9:W28,3))","v":0},null,null,null,{"$f":"SUM(LARGE(AA9:AA28,1),LARGE(AA9:AA28,2),LARGE(AA9:AA28,3))","v":0},{"$f":"SUM(G30,K30,O30,S30,W30,AA30)","v":0}]

{"sheet":"Wertungszettel M1","index":14,"n_rows":200,"n_cols":6,"rows_kept":200,"cut":false,"hidden":false,"merged":[[6,0,7,0],[6,1,7,1],[6,2,7,2],[6,3,7,3],[6,5,7,5],[4,2,4,5],[0,3,0,4],[1,3,1,4],[2,3,2,4],[12,0,13,0],[12,1,13,1],[12,2,13,2],[12,3,13,3],[12,5,13,5],[8,0,9,0],[8,1,9,1],[8,2,9,2],[8,3,9,3],[8,5,9,5],[10,0,11,0],[10,1,11,1],[10,2,11,2],[10,3,11,3],[10,5,11,5],[16,0,17,0],[16,1,17,1],[16,2,17,2],[16,3,17,3],[16,5,17,5],[14,0,15,0],[14,1,15,1],[14,2,15,2],[14,3,15,3],[14,5,15,5],[20,0,21,0],[20,1,21,1],[20,2,21,2],[20,3,21,3],[20,5,21,5],[18,0,19,0],[18,1,19,1],[18,2,19,2],[18,3,19,3],[18,5,19,5],[22,0,23,0],[22,1,23,1],[22,2,23,2],[22,3,23,3],[22,5,23,5],[30,0,31,0],[30,1,31,1],[30,2,31,2],[30,3,31,3],[30,5,31,5],[28,0,29,0],[28,1,29,1],[28,2,29,2],[28,3,29,3],[28,5,29,5],[26,0,27,0],[26,1,27,1],[26,2,27,2],[26,3,27,3],[26,5,27,5],[24,0,25,0],[24,1,25,1],[24,2,25,2],[24,3,25,3],[24,5,25,5],[37,2,37,5],[39,0,40,0],[39,1,40,1],[39,2,40,2],[39,3,40,3],[39,5,40,5],[32,0,33,0],[32,1,33,1],[32,2,33,2],[32,3,33,3],[32,5,33,5],[34,0,35,0],[34,1,35,1],[34,2,35,2],[34,3,35,3],[34,5,35,5],[43,0,44,0],[43,1,44,1],[43,2,44,2],[43,3,44,3],[43,5,44,5],[41,0,42,0],[41,1,42,1],[41,2,42,2],[41,3,42,3],[41,5,42,5],[47,0,48,0],[47,1,48,1],[47,2,48,2],[47,3,48,3],[47,5,48,5],[45,0,46,0],[45,1,46,1],[45,2,46,2],[45,3,46,3],[45,5,46,5],[51,0,52,0],[51,1,52,1],[51,2,52,2],[51,3,52,3],[51,5,52,5],[49,0,50,0],[49,1,50,1],[49,2,50,2],[49,3,50,3],[49,5,50,5],[55,0,56,0],[55,1,56,1],[55,2,56,2],[55,3,56,3],[55,5,56,5],[53,0,54,0],[53,1,54,1],[53,2,54,2],[53,3,54,3],[53,5,54,5],[59,0,60,0],[59,1,60,1],[59,2,60,2],[59,3,60,3],[59,5,60,5],[57,0,58,0],[57,1,58,1],[57,2,58,2],[57,3,58,3],[57,5,58,5],[63,0,64,0],[63,1,64,1],[63,2,64,2],[63,3,64,3],[63,5,64,5],[61,0,62,0],[61,1,62,1],[61,2,62,2],[61,3,62,3],[61,5,62,5],[67,0,68,0],[67,1,68,1],[67,2,68,2],[67,3,68,3],[67,5,68,5],[65,0,66,0],[65,1,66,1],[65,2,66,2],[65,3,66,3],[65,5,66,5],[70,2,70,5],[72,0,73,0],[72,1,73,1],[72,2,73,2],[72,3,73,3],[72,5,73,5],[74,0,75,0],[74,1,75,1],[74,2,75,2],[74,3,75,3],[74,5,75,5],[76,0,77,0],[76,1,77,1],[76,2,77,2],[76,3,77,3],[76,5,77,5],[78,0,79,0],[78,1,79,1],[78,2,79,2],[78,3,79,3],[78,5,79,5],[80,0,81,0],[80,1,81,1],[80,2,81,2],[80,3,81,3],[80,5,81,5],[82,0,83,0],[82,1,83,1],[82,2,83,2],[82,3,83,3],[82,5,83,5],[84,0,85,0],[84,1,85,1],[84,2,85,2],[84,3,85,3],[84,5,85,5],[86,0,87,0],[86,1,87,1],[86,2,87,2],[86,3,87,3],[86,5,87,5],[88,0,89,0],[88,1,89,1],[88,2,89,2],[88,3,89,3],[88,5,89,5],[90,0,91,0],[90,1,91,1],[90,2,91,2],[90,3,91,3],[90,5,91,5],[92,0,93,0],[92,1,93,1],[92,2,93,2],[92,3,93,3],[92,5,93,5],[94,0,95,0],[94,1,95,1],[94,2,95,2],[94,3,95,3],[94,5,95,5],[96,0,97,0],[96,1,97,1],[96,2,97,2],[96,3,97,3],[96,5,97,5],[98,0,99,0],[98,1,99,1],[98,2,99,2],[98,3,99,3],[98,5,99,5],[100,0,101,0],[100,1,101,1],[100,2,101,2],[100,3,101,3],[100,5,101,5],[103,2,103,5],[105,0,106,0],[105,1,106,1],[105,2,106,2],[105,3,106,3],[105,5,106,5],[107,0,108,0],[107,1,108,1],[107,2,108,2],[107,3,108,3],[107,5,108,5],[109,0,110,0],[109,1,110,1],[109,2,110,2],[109,3,110,3],[109,5,110,5],[111,0,112,0],[111,1,112,1],[111,2,112,2],[111,3,112,3],[111,5,112,5],[113,0,114,0],[113,1,114,1],[113,2,114,2],[113,3,114,3],[113,5,114,5],[115,0,116,0],[115,1,116,1],[115,2,116,2],[115,3,116,3],[115,5,116,5],[117,0,118,0],[117,1,118,1],[117,2,118,2],[117,3,118,3],[117,5,118,5],[119,0,120,0],[119,1,120,1],[119,2,120,2],[119,3,120,3],[119,5,120,5],[121,0,122,0],[121,1,122,1],[121,2,122,2],[121,3,122,3],[121,5,122,5],[123,0,124,0],[123,1,124,1],[123,2,124,2],[123,3,124,3],[123,5,124,5],[125,0,126,0],[125,1,126,1],[125,2,126,2],[125,3,126,3],[125,5,126,5],[127,0,128,0],[127,1,128,1],[127,2,128,2],[127,3,128,3],[127,5,128,5],[129,0,130,0],[129,1,130,1],[129,2,130,2],[129,3,130,3],[129,5,130,5],[131,0,132,0],[131,1,132,1],[131,2,132,2],[131,3,132,3],[131,5,132,5],[133,0,134,0],[133,1,134,1],[133,2,134,2],[133,3,134,3],[133,5,134,5],[136,2,136,5],[138,0,139,0],[138,1,139,1],[138,2,139,2],[138,3,139,3],[138,5,139,5],[140,0,141,0],[140,1,141,1],[140,2,141,2],[140,3,141,3],[140,5,141,5],[142,0,143,0],[142,1,143,1],[142,2,143,2],[142,3,143,3],[142,5,143,5],[144,0,145,0],[144,1,145,1],[144,2,145,2],[144,3,145,3],[144,5,145,5],[146,0,147,0],[146,1,147,1],[146,2,147,2],[146,3,147,3],[146,5,147,5],[148,0,149,0],[148,1,149,1],[148,2,149,2],[148,3,149,3],[148,5,149,5],[150,0,151,0],[150,1,151,1],[150,2,151,2],[150,3,151,3],[150,5,151,5],[152,0,153,0],[152,1,153,1],[152,2,153,2],[152,3,153,3],[152,5,153,5],[154,0,155,0],[154,1,155,1],[154,2,155,2],[154,3,155,3],[154,5,155,5],[156,0,157,0],[156,1,157,1],[156,2,157,2],[156,3,157,3],[156,5,157,5],[158,0,159,0],[158,1,159,1],[158,2,159,2],[158,3,159,3],[158,5,159,5],[160,0,161,0],[160,1,161,1],[160,2,161,2],[160,3,161,3],[160,5,161,5],[162,0,163,0],[162,1,163,1],[162,2,163,2],[162,3,163,3],[162,5,163,5],[164,0,165,0],[164,1,165,1],[164,2,165,2],[164,3,165,3],[164,5,165,5],[166,0,167,0],[166,1,167,1],[166,2,167,2],[166,3,167,3],[166,5,167,5],[169,2,169,5],[171,0,172,0],[171,1,172,1],[171,2,172,2],[171,3,172,3],[171,5,172,5],[173,0,174,0],[173,1,174,1],[173,2,174,2],[173,3,174,3],[173,5,174,5],[175,0,176,0],[175,1,176,1],[175,2,176,2],[175,3,176,3],[175,5,176,5],[177,0,178,0],[177,1,178,1],[177,2,178,2],[177,3,178,3],[177,5,178,5],[179,0,180,0],[179,1,180,1],[179,2,180,2],[179,3,180,3],[179,5,180,5],[181,0,182,0],[181,1,182,1],[181,2,182,2],[181,3,182,3],[181,5,182,5],[183,0,184,0],[183,1,184,1],[183,2,184,2],[183,3,184,3],[183,5,184,5],[185,0,186,0],[185,1,186,1],[185,2,186,2],[185,3,186,3],[185,5,186,5],[187,0,188,0],[187,1,188,1],[187,2,188,2],[187,3,188,3],[187,5,188,5],[189,0,190,0],[189,1,190,1],[189,2,190,2],[189,3,190,3],[189,5,190,5],[191,0,192,0],[191,1,192,1],[191,2,192,2],[191,3,192,3],[191,5,192,5],[193,0,194,0],[193,1,194,1],[193,2,194,2],[193,3,194,3],[193,5,194,5],[195,0,196,0],[195,1,196,1],[195,2,196,2],[195,3,196,3],[195,5,196,5],[197,0,198,0],[197,1,198,1],[197,2,198,2],[197,3,198,3],[197,5,198,5],[199,0,200,0],[199,1,200,1],[199,2,200,2],[199,3,200,3],[199,5,200,5]]}
["Wettkampfbogen",null,"Ort / Datum :",{"$f":"'INFO Blatt'!B11","v":"Hehlen"},null,{"$f":"'INFO Blatt'!B13","v":"2018-03-03"}]
[null,null,"Mannschaft:",{"$f":"Formeln!A5","v":"MTV Boffzen"},null,"Wertungsvorschriften"]
[null,null,"Liga:",{"$f":"'INFO Blatt'!B7","v":"Schülerliga Süd"},null,{"$f":"'INFO Blatt'!B5","v":"P-Stufen"}]
[]
["Name","Jg","Boden"]
[null,null,"D-Note","Abzug OK","E- Abzug","Note"]
["Erik Komnick","04"]
[]
["Moritz Böhm","04"]
[]
["Marc Ormann","04"]
[]
["Erik Schäfer","05"]
[]
["Emil Meisner","06"]
[]
[]
[]
[]
[]
[]
[]
[]
[]
[]
[]
[]
[]
[]
[]
[]
[]
[]
[]
[]
[]
[]
["Name","Jg","Pauschenpferd"]
[null,null,"D-Note","Abzug OK","E- Abzug","Note"]
[{"$f":"IF(A7>0,A7,\"\")","v":"Erik Komnick"},{"$f":"IF(B7>0,B7,\"\")","v":"04"}]
[]
[{"$f":"IF(A9>0,A9,\"\")","v":"Moritz Böhm"},"04"]
[]
[{"$f":"IF(A11>0,A11,\"\")","v":"Marc Ormann"},"04"]
[]
[{"$f":"IF(A13>0,A13,\"\")","v":"Erik Schäfer"},"05"]
[]
[{"$f":"IF(A15>0,A15,\"\")","v":"Emil Meisner"},"06"]
[]
[{"$f":"IF(A17>0,A17,\"\")","v":""},""]
[]
[{"$f":"IF(A19>0,A19,\"\")","v":""},""]
[]
[{"$f":"IF(A21>0,A21,\"\")","v":""},""]
[]
[{"$f":"IF(A23>0,A23,\"\")","v":""},""]
[]
[{"$f":"IF(A25>0,A25,\"\")","v":""},""]
[]
[{"$f":"IF(A27>0,A27,\"\")","v":""},""]
[]
[{"$f":"IF(A29>0,A29,\"\")","v":""},""]
[]
[{"$f":"IF(A31>0,A31,\"\")","v":""},""]
[]
[{"$f":"IF(A33>0,A33,\"\")","v":""},""]
[]
[{"$f":"IF(A35>0,A35,\"\")","v":""},""]
[]
[]
["Name","Jg","Ringe"]
[null,null,"D-Note","Abzug OK","E- Abzug","Note"]
[{"$f":"IF(A40>0,A40,\"\")","v":"Erik Komnick"},{"$f":"IF(B40>0,B40,\"\")","v":"04"}]
[]
[{"$f":"IF(A42>0,A42,\"\")","v":"Moritz Böhm"},"04"]
[]
[{"$f":"IF(A44>0,A44,\"\")","v":"Marc Ormann"},"04"]
[]
[{"$f":"IF(A46>0,A46,\"\")","v":"Erik Schäfer"},"05"]
[]
[{"$f":"IF(A48>0,A48,\"\")","v":"Emil Meisner"},"06"]
[]
[{"$f":"IF(A50>0,A50,\"\")","v":""},""]
[]
[{"$f":"IF(A52>0,A52,\"\")","v":""},""]
[]
[{"$f":"IF(A54>0,A54,\"\")","v":""},""]
[]
[{"$f":"IF(A56>0,A56,\"\")","v":""},""]
[]
[{"$f":"IF(A58>0,A58,\"\")","v":""},""]
[]
[{"$f":"IF(A60>0,A60,\"\")","v":""},""]
[]
[{"$f":"IF(A62>0,A62,\"\")","v":""},""]
[]
[{"$f":"IF(A64>0,A64,\"\")","v":""},""]
[]
[{"$f":"IF(A66>0,A66,\"\")","v":""},""]
[]
[{"$f":"IF(A68>0,A68,\"\")","v":""},""]
[]
[]
["Name","Jg","Sprung"]
[null,null,"D-Note","Abzug OK","E- Abzug","Note"]
[{"$f":"IF(A73>0,A73,\"\")","v":"Erik Komnick"},{"$f":"IF(B73>0,B73,\"\")","v":"04"}]
[]
[{"$f":"IF(A75>0,A75,\"\")","v":"Moritz Böhm"},"04"]
[]
[{"$f":"IF(A77>0,A77,\"\")","v":"Marc Ormann"},"04"]
[]
[{"$f":"IF(A79>0,A79,\"\")","v":"Erik Schäfer"},"05"]
[]
[{"$f":"IF(A81>0,A81,\"\")","v":"Emil Meisner"},"06"]
[]
[{"$f":"IF(A83>0,A83,\"\")","v":""},""]
[]
[{"$f":"IF(A85>0,A85,\"\")","v":""},""]
[]
[{"$f":"IF(A87>0,A87,\"\")","v":""},""]
[]
[{"$f":"IF(A89>0,A89,\"\")","v":""},""]
[]
[{"$f":"IF(A91>0,A91,\"\")","v":""},""]
[]
[{"$f":"IF(A93>0,A93,\"\")","v":""},""]
[]
[{"$f":"IF(A95>0,A95,\"\")","v":""},""]
[]
[{"$f":"IF(A97>0,A97,\"\")","v":""},""]
[]
[{"$f":"IF(A99>0,A99,\"\")","v":""},""]
[]
[{"$f":"IF(A101>0,A101,\"\")","v":""},""]
[]
[]
["Name","Jg","Barren"]
[null,null,"D-Note","Abzug OK","E- Abzug","Note"]
[{"$f":"IF(A106>0,A106,\"\")","v":"Erik Komnick"},{"$f":"IF(B106>0,B106,\"\")","v":"04"}]
[]
[{"$f":"IF(A108>0,A108,\"\")","v":"Moritz Böhm"},"04"]
[]
[{"$f":"IF(A110>0,A110,\"\")","v":"Marc Ormann"},"04"]
[]
[{"$f":"IF(A112>0,A112,\"\")","v":"Erik Schäfer"},"05"]
[]
[{"$f":"IF(A114>0,A114,\"\")","v":"Emil Meisner"},"06"]
[]
[{"$f":"IF(A116>0,A116,\"\")","v":""},""]
[]
[{"$f":"IF(A118>0,A118,\"\")","v":""},""]
[]
[{"$f":"IF(A120>0,A120,\"\")","v":""},""]
[]
[{"$f":"IF(A122>0,A122,\"\")","v":""},""]
[]
[{"$f":"IF(A124>0,A124,\"\")","v":""},""]
[]
[{"$f":"IF(A126>0,A126,\"\")","v":""},""]
[]
[{"$f":"IF(A128>0,A128,\"\")","v":""},""]
[]
[{"$f":"IF(A130>0,A130,\"\")","v":""},""]
[]
[{"$f":"IF(A132>0,A132,\"\")","v":""},""]
[]
[{"$f":"IF(A134>0,A134,\"\")","v":""},""]
[]
[]
["Name","Jg","Reck"]
[null,null,"D-Note","Abzug OK","E- Abzug","Note"]
[{"$f":"IF(A139>0,A139,\"\")","v":"Erik Komnick"},{"$f":"IF(B139>0,B139,\"\")","v":"04"}]
[]
[{"$f":"IF(A141>0,A141,\"\")","v":"Moritz Böhm"},"04"]
[]
[{"$f":"IF(A143>0,A143,\"\")","v":"Marc Ormann"},"04"]
[]
[{"$f":"IF(A145>0,A145,\"\")","v":"Erik Schäfer"},"05"]
[]
[{"$f":"IF(A147>0,A147,\"\")","v":"Emil Meisner"},"06"]
[]
[{"$f":"IF(A149>0,A149,\"\")","v":""},""]
[]
[{"$f":"IF(A151>0,A151,\"\")","v":""},""]
[]
[{"$f":"IF(A153>0,A153,\"\")","v":""},""]
[]
[{"$f":"IF(A155>0,A155,\"\")","v":""},""]
[]
[{"$f":"IF(A157>0,A157,\"\")","v":""},""]
[]
[{"$f":"IF(A159>0,A159,\"\")","v":""},""]
[]
[{"$f":"IF(A161>0,A161,\"\")","v":""},""]
[]
[{"$f":"IF(A163>0,A163,\"\")","v":""},""]
[]
[{"$f":"IF(A165>0,A165,\"\")","v":""},""]
[]
[{"$f":"IF(A167>0,A167,\"\")","v":""},""]

{"sheet":"Wertungszettel M2","index":15,"n_rows":200,"n_cols":6,"rows_kept":200,"cut":false,"hidden":false,"merged":[[4,2,4,5],[8,0,9,0],[8,1,9,1],[8,2,9,2],[8,3,9,3],[8,5,9,5],[6,0,7,0],[6,1,7,1],[6,2,7,2],[6,3,7,3],[6,5,7,5],[12,0,13,0],[12,1,13,1],[12,2,13,2],[12,3,13,3],[12,5,13,5],[10,0,11,0],[10,1,11,1],[10,2,11,2],[10,3,11,3],[10,5,11,5],[16,0,17,0],[16,1,17,1],[16,2,17,2],[16,3,17,3],[16,5,17,5],[14,0,15,0],[14,1,15,1],[14,2,15,2],[14,3,15,3],[14,5,15,5],[20,0,21,0],[20,1,21,1],[20,2,21,2],[20,3,21,3],[20,5,21,5],[18,0,19,0],[18,1,19,1],[18,2,19,2],[18,3,19,3],[18,5,19,5],[24,0,25,0],[24,1,25,1],[24,2,25,2],[24,3,25,3],[24,5,25,5],[22,0,23,0],[22,1,23,1],[22,2,23,2],[22,3,23,3],[22,5,23,5],[28,0,29,0],[28,1,29,1],[28,2,29,2],[28,3,29,3],[28,5,29,5],[26,0,27,0],[26,1,27,1],[26,2,27,2],[26,3,27,3],[26,5,27,5],[32,0,33,0],[32,1,33,1],[32,2,33,2],[32,3,33,3],[32,5,33,5],[30,0,31,0],[30,1,31,1],[30,2,31,2],[30,3,31,3],[30,5,31,5],[39,0,40,0],[39,1,40,1],[39,2,40,2],[39,3,40,3],[39,5,40,5],[37,2,37,5],[34,0,35,0],[34,1,35,1],[34,2,35,2],[34,3,35,3],[34,5,35,5],[43,0,44,0],[43,1,44,1],[43,2,44,2],[43,3,44,3],[43,5,44,5],[41,0,42,0],[41,1,42,1],[41,2,42,2],[41,3,42,3],[41,5,42,5],[47,0,48,0],[47,1,48,1],[47,2,48,2],[47,3,48,3],[47,5,48,5],[45,0,46,0],[45,1,46,1],[45,2,46,2],[45,3,46,3],[45,5,46,5],[51,0,52,0],[51,1,52,1],[51,2,52,2],[51,3,52,3],[51,5,52,5],[49,0,50,0],[49,1,50,1],[49,2,50,2],[49,3,50,3],[49,5,50,5],[55,0,56,0],[55,1,56,1],[55,2,56,2],[55,3,56,3],[55,5,56,5],[53,0,54,0],[53,1,54,1],[53,2,54,2],[53,3,54,3],[53,5,54,5],[59,0,60,0],[59,1,60,1],[59,2,60,2],[59,3,60,3],[59,5,60,5],[57,0,58,0],[57,1,58,1],[57,2,58,2],[57,3,58,3],[57,5,58,5],[63,0,64,0],[63,1,64,1],[63,2,64,2],[63,3,64,3],[63,5,64,5],[61,0,62,0],[61,1,62,1],[61,2,62,2],[61,3,62,3],[61,5,62,5],[67,0,68,0],[67,1,68,1],[67,2,68,2],[67,3,68,3],[67,5,68,5],[65,0,66,0],[65,1,66,1],[65,2,66,2],[65,3,66,3],[65,5,66,5],[70,2,70,5],[72,0,73,0],[72,1,73,1],[72,2,73,2],[72,3,73,3],[72,5,73,5],[74,0,75,0],[74,1,75,1],[74,2,75,2],[74,3,75,3],[74,5,75,5],[76,0,77,0],[76,1,77,1],[76,2,77,2],[76,3,77,3],[76,5,77,5],[78,0,79,0],[78,1,79,1],[78,2,79,2],[78,3,79,3],[78,5,79,5],[80,0,81,0],[80,1,81,1],[80,2,81,2],[80,3,81,3],[80,5,81,5],[82,0,83,0],[82,1,83,1],[82,2,83,2],[82,3,83,3],[82,5,83,5],[84,0,85,0],[84,1,85,1],[84,2,85,2],[84,3,85,3],[84,5,85,5],[86,0,87,0],[86,1,87,1],[86,2,87,2],[86,3,87,3],[86,5,87,5],[88,0,89,0],[88,1,89,1],[88,2,89,2],[88,3,89,3],[88,5,89,5],[90,0,91,0],[90,1,91,1],[90,2,91,2],[90,3,91,3],[90,5,91,5],[92,0,93,0],[92,1,93,1],[92,2,93,2],[92,3,93,3],[92,5,93,5],[94,0,95,0],[94,1,95,1],[94,2,95,2],[94,3,95,3],[94,5,95,5],[96,0,97,0],[96,1,97,1],[96,2,97,2],[96,3,97,3],[96,5,97,5],[98,0,99,0],[98,1,99,1],[98,2,99,2],[98,3,99,3],[98,5,99,5],[100,0,101,0],[100,1,101,1],[100,2,101,2],[100,3,101,3],[100,5,101,5],[103,2,103,5],[105,0,106,0],[105,1,106,1],[105,2,106,2],[105,3,106,3],[105,5,106,5],[107,0,108,0],[107,1,108,1],[107,2,108,2],[107,3,108,3],[107,5,108,5],[109,0,110,0],[109,1,110,1],[109,2,110,2],[109,3,110,3],[109,5,110,5],[111,0,112,0],[111,1,112,1],[111,2,112,2],[111,3,112,3],[111,5,112,5],[113,0,114,0],[113,1,114,1],[113,2,114,2],[113,3,114,3],[113,5,114,5],[115,0,116,0],[115,1,116,1],[115,2,116,2],[115,3,116,3],[115,5,116,5],[117,0,118,0],[117,1,118,1],[117,2,118,2],[117,3,118,3],[117,5,118,5],[119,0,120,0],[119,1,120,1],[119,2,120,2],[119,3,120,3],[119,5,120,5],[121,0,122,0],[121,1,122,1],[121,2,122,2],[121,3,122,3],[121,5,122,5],[123,0,124,0],[123,1,124,1],[123,2,124,2],[123,3,124,3],[123,5,124,5],[125,0,126,0],[125,1,126,1],[125,2,126,2],[125,3,126,3],[125,5,126,5],[127,0,128,0],[127,1,128,1],[127,2,128,2],[127,3,128,3],[127,5,128,5],[129,0,130,0],[129,1,130,1],[129,2,130,2],[129,3,130,3],[129,5,130,5],[131,0,132,0],[131,1,132,1],[131,2,132,2],[131,3,132,3],[131,5,132,5],[133,0,134,0],[133,1,134,1],[133,2,134,2],[133,3,134,3],[133,5,134,5],[136,2,136,5],[138,0,139,0],[138,1,139,1],[138,2,139,2],[138,3,139,3],[138,5,139,5],[140,0,141,0],[140,1,141,1],[140,2,141,2],[140,3,141,3],[140,5,141,5],[142,0,143,0],[142,1,143,1],[142,2,143,2],[142,3,143,3],[142,5,143,5],[144,0,145,0],[144,1,145,1],[144,2,145,2],[144,3,145,3],[144,5,145,5],[146,0,147,0],[146,1,147,1],[146,2,147,2],[146,3,147,3],[146,5,147,5],[148,0,149,0],[148,1,149,1],[148,2,149,2],[148,3,149,3],[148,5,149,5],[150,0,151,0],[150,1,151,1],[150,2,151,2],[150,3,151,3],[150,5,151,5],[152,0,153,0],[152,1,153,1],[152,2,153,2],[152,3,153,3],[152,5,153,5],[154,0,155,0],[154,1,155,1],[154,2,155,2],[154,3,155,3],[154,5,155,5],[156,0,157,0],[156,1,157,1],[156,2,157,2],[156,3,157,3],[156,5,157,5],[158,0,159,0],[158,1,159,1],[158,2,159,2],[158,3,159,3],[158,5,159,5],[160,0,161,0],[160,1,161,1],[160,2,161,2],[160,3,161,3],[160,5,161,5],[162,0,163,0],[162,1,163,1],[162,2,163,2],[162,3,163,3],[162,5,163,5],[164,0,165,0],[164,1,165,1],[164,2,165,2],[164,3,165,3],[164,5,165,5],[166,0,167,0],[166,1,167,1],[166,2,167,2],[166,3,167,3],[166,5,167,5],[169,2,169,5],[171,0,172,0],[171,1,172,1],[171,2,172,2],[171,3,172,3],[171,5,172,5],[173,0,174,0],[173,1,174,1],[173,2,174,2],[173,3,174,3],[173,5,174,5],[175,0,176,0],[175,1,176,1],[175,2,176,2],[175,3,176,3],[175,5,176,5],[177,0,178,0],[177,1,178,1],[177,2,178,2],[177,3,178,3],[177,5,178,5],[179,0,180,0],[179,1,180,1],[179,2,180,2],[179,3,180,3],[179,5,180,5],[181,0,182,0],[181,1,182,1],[181,2,182,2],[181,3,182,3],[181,5,182,5],[183,0,184,0],[183,1,184,1],[183,2,184,2],[183,3,184,3],[183,5,184,5],[185,0,186,0],[185,1,186,1],[185,2,186,2],[185,3,186,3],[185,5,186,5],[187,0,188,0],[187,1,188,1],[187,2,188,2],[187,3,188,3],[187,5,188,5],[189,1,190,1],[189,2,190,2],[189,3,190,3],[189,5,190,5],[191,0,192,0],[191,1,192,1],[191,2,192,2],[191,3,192,3],[191,5,192,5],[0,3,0,4],[1,3,1,4],[2,3,2,4],[197,0,198,0],[197,1,198,1],[197,2,198,2],[197,3,198,3],[197,5,198,5],[199,0,200,0],[199,1,200,1],[199,2,200,2],[199,3,200,3],[199,5,200,5],[193,0,194,0],[193,1,194,1],[193,2,194,2],[193,3,194,3],[193,5,194,5],[195,0,196,0],[195,1,196,1],[195,2,196,2],[195,3,196,3],[195,5,196,5],[189,0,190,0]]}
["Wettkampfbogen",null,"Ort / Datum :",{"$f":"'INFO Blatt'!B11","v":"Hehlen"},null,{"$f":"'INFO Blatt'!B13","v":"2018-03-03"}]
[null,null,"Mannschaft:",{"$f":"Formeln!A6","v":"TC Jahn Hehlen"},null,"Wertungsvorschriften"]
[null,null,"Liga:",{"$f":"'INFO Blatt'!B7","v":"Schülerliga Süd"},null,{"$f":"'INFO Blatt'!B5","v":"P-Stufen"}]
[]
["Name","Jg","Boden"]
[null,null,"D-Note","Abzug OK","E- Abzug","Note"]
["Paul Bähr","05"]
[]
["Benjamin Berg","07"]
[]
["Niklas Bohlender","04"]
[]
["Niclas Brinkmann","05"]
[]
["Jonas Firedrich","07"]
[]
["Ilja Kant","06"]
[]
["Tom Weper","06"]
[]
["Frederik Zwickert","07"]
[]
[]
[]
[]
[]
[]
[]
[]
[]
[]
[]
[]
[]
[]
[]
[]
["Name","Jg","Pauschenpferd"]
[null,null,"D-Note","Abzug OK","E- Abzug","Note"]
[{"$f":"IF(A7>0,A7,\"\")","v":"Paul Bähr"},{"$f":"IF(B7>0,B7,\"\")","v":"05"}]
[]
[{"$f":"IF(A9>0,A9,\"\")","v":"Benjamin Berg"},"07"]
[]
[{"$f":"IF(A11>0,A11,\"\")","v":"Niklas Bohlender"},"04"]
[]
[{"$f":"IF(A13>0,A13,\"\")","v":"Niclas Brinkmann"},"05"]
[]
[{"$f":"IF(A15>0,A15,\"\")","v":"Jonas Firedrich"},"07"]
[]
[{"$f":"IF(A17>0,A17,\"\")","v":"Ilja Kant"},"06"]
[]
[{"$f":"IF(A19>0,A19,\"\")","v":"Tom Weper"},"06"]
[]
[{"$f":"IF(A21>0,A21,\"\")","v":"Frederik Zwickert"},"07"]
[]
[{"$f":"IF(A23>0,A23,\"\")","v":""},""]
[]
[{"$f":"IF(A25>0,A25,\"\")","v":""},""]
[]
[{"$f":"IF(A27>0,A27,\"\")","v":""},""]
[]
[{"$f":"IF(A29>0,A29,\"\")","v":""},""]
[]
[{"$f":"IF(A31>0,A31,\"\")","v":""},""]
[]
[{"$f":"IF(A33>0,A33,\"\")","v":""},""]
[]
[{"$f":"IF(A35>0,A35,\"\")","v":""},""]
[]
[]
["Name","Jg","Ringe"]
[null,null,"D-Note","Abzug OK","E- Abzug","Note"]
[{"$f":"IF(A40>0,A40,\"\")","v":"Paul Bähr"},{"$f":"IF(B40>0,B40,\"\")","v":"05"}]
[]
[{"$f":"IF(A42>0,A42,\"\")","v":"Benjamin Berg"},"07"]
[]
[{"$f":"IF(A44>0,A44,\"\")","v":"Niklas Bohlender"},"04"]
[]
[{"$f":"IF(A46>0,A46,\"\")","v":"Niclas Brinkmann"},"05"]
[]
[{"$f":"IF(A48>0,A48,\"\")","v":"Jonas Firedrich"},"07"]
[]
[{"$f":"IF(A50>0,A50,\"\")","v":"Ilja Kant"},"06"]
[]
[{"$f":"IF(A52>0,A52,\"\")","v":"Tom Weper"},"06"]
[]
[{"$f":"IF(A54>0,A54,\"\")","v":"Frederik Zwickert"},"07"]
[]
[{"$f":"IF(A56>0,A56,\"\")","v":""},""]
[]
[{"$f":"IF(A58>0,A58,\"\")","v":""},""]
[]
[{"$f":"IF(A60>0,A60,\"\")","v":""},""]
[]
[{"$f":"IF(A62>0,A62,\"\")","v":""},""]
[]
[{"$f":"IF(A64>0,A64,\"\")","v":""},""]
[]
[{"$f":"IF(A66>0,A66,\"\")","v":""},""]
[]
[{"$f":"IF(A68>0,A68,\"\")","v":""},""]
[]
[]
["Name","Jg","Sprung"]
[null,null,"D-Note","Abzug OK","E- Abzug","Note"]
[{"$f":"IF(A73>0,A73,\"\")","v":"Paul Bähr"},{"$f":"IF(B73>0,B73,\"\")","v":"05"}]
[]
[{"$f":"IF(A75>0,A75,\"\")","v":"Benjamin Berg"},"07"]
[]
[{"$f":"IF(A77>0,A77,\"\")","v":"Niklas Bohlender"},"04"]
[]
[{"$f":"IF(A79>0,A79,\"\")","v":"Niclas Brinkmann"},"05"]
[]
[{"$f":"IF(A81>0,A81,\"\")","v":"Jonas Firedrich"},"07"]
[]
[{"$f":"IF(A83>0,A83,\"\")","v":"Ilja Kant"},"06"]
[]
[{"$f":"IF(A85>0,A85,\"\")","v":"Tom Weper"},"06"]
[]
[{"$f":"IF(A87>0,A87,\"\")","v":"Frederik Zwickert"},"07"]
[]
[{"$f":"IF(A89>0,A89,\"\")","v":""},""]
[]
[{"$f":"IF(A91>0,A91,\"\")","v":""},""]
[]
[{"$f":"IF(A93>0,A93,\"\")","v":""},""]
[]
[{"$f":"IF(A95>0,A95,\"\")","v":""},""]
[]
[{"$f":"IF(A97>0,A97,\"\")","v":""},""]
[]
[{"$f":"IF(A99>0,A99,\"\")","v":""},""]
[]
[{"$f":"IF(A101>0,A101,\"\")","v":""},""]
[]
[]
["Name","Jg","Barren"]
[null,null,"D-Note","Abzug OK","E- Abzug","Note"]
[{"$f":"IF(A106>0,A106,\"\")","v":"Paul Bähr"},{"$f":"IF(B106>0,B106,\"\")","v":"05"}]
[]
[{"$f":"IF(A108>0,A108,\"\")","v":"Benjamin Berg"},"07"]
[]
[{"$f":"IF(A110>0,A110,\"\")","v":"Niklas Bohlender"},"04"]
[]
[{"$f":"IF(A112>0,A112,\"\")","v":"Niclas Brinkmann"},"05"]
[]
[{"$f":"IF(A114>0,A114,\"\")","v":"Jonas Firedrich"},"07"]
[]
[{"$f":"IF(A116>0,A116,\"\")","v":"Ilja Kant"},"06"]
[]
[{"$f":"IF(A118>0,A118,\"\")","v":"Tom Weper"},"06"]
[]
[{"$f":"IF(A120>0,A120,\"\")","v":"Frederik Zwickert"},"07"]
[]
[{"$f":"IF(A122>0,A122,\"\")","v":""},""]
[]
[{"$f":"IF(A124>0,A124,\"\")","v":""},""]
[]
[{"$f":"IF(A126>0,A126,\"\")","v":""},""]
[]
[{"$f":"IF(A128>0,A128,\"\")","v":""},""]
[]
[{"$f":"IF(A130>0,A130,\"\")","v":""},""]
[]
[{"$f":"IF(A132>0,A132,\"\")","v":""},""]
[]
[{"$f":"IF(A134>0,A134,\"\")","v":""},""]
[]
[]
["Name","Jg","Reck"]
[null,null,"D-Note","Abzug OK","E- Abzug","Note"]
[{"$f":"IF(A139>0,A139,\"\")","v":"Paul Bähr"},{"$f":"IF(B139>0,B139,\"\")","v":"05"}]
[]
[{"$f":"IF(A141>0,A141,\"\")","v":"Benjamin Berg"},"07"]
[]
[{"$f":"IF(A143>0,A143,\"\")","v":"Niklas Bohlender"},"04"]
[]
[{"$f":"IF(A145>0,A145,\"\")","v":"Niclas Brinkmann"},"05"]
[]
[{"$f":"IF(A147>0,A147,\"\")","v":"Jonas Firedrich"},"07"]
[]
[{"$f":"IF(A149>0,A149,\"\")","v":"Ilja Kant"},"06"]
[]
[{"$f":"IF(A151>0,A151,\"\")","v":"Tom Weper"},"06"]
[]
[{"$f":"IF(A153>0,A153,\"\")","v":"Frederik Zwickert"},"07"]
[]
[{"$f":"IF(A155>0,A155,\"\")","v":""},""]
[]
[{"$f":"IF(A157>0,A157,\"\")","v":""},""]
[]
[{"$f":"IF(A159>0,A159,\"\")","v":""},""]
[]
[{"$f":"IF(A161>0,A161,\"\")","v":""},""]
[]
[{"$f":"IF(A163>0,A163,\"\")","v":""},""]
[]
[{"$f":"IF(A165>0,A165,\"\")","v":""},""]
[]
[{"$f":"IF(A167>0,A167,\"\")","v":""},""]

{"sheet":"Wertungszettel M3","index":16,"n_rows":200,"n_cols":6,"rows_kept":200,"cut":false,"hidden":false,"merged":[[10,0,11,0],[10,1,11,1],[10,2,11,2],[10,3,11,3],[10,5,11,5],[4,2,4,5],[8,0,9,0],[8,1,9,1],[8,2,9,2],[8,3,9,3],[8,5,9,5],[6,0,7,0],[6,1,7,1],[6,2,7,2],[6,3,7,3],[6,5,7,5],[14,0,15,0],[14,1,15,1],[14,2,15,2],[14,3,15,3],[14,5,15,5],[12,0,13,0],[12,1,13,1],[12,2,13,2],[12,3,13,3],[12,5,13,5],[18,0,19,0],[18,1,19,1],[18,2,19,2],[18,3,19,3],[18,5,19,5],[16,0,17,0],[16,1,17,1],[16,2,17,2],[16,3,17,3],[16,5,17,5],[22,0,23,0],[22,1,23,1],[22,2,23,2],[22,3,23,3],[22,5,23,5],[20,0,21,0],[20,1,21,1],[20,2,21,2],[20,3,21,3],[20,5,21,5],[26,0,27,0],[26,1,27,1],[26,2,27,2],[26,3,27,3],[26,5,27,5],[24,0,25,0],[24,1,25,1],[24,2,25,2],[24,3,25,3],[24,5,25,5],[30,0,31,0],[30,1,31,1],[30,2,31,2],[30,3,31,3],[30,5,31,5],[28,0,29,0],[28,1,29,1],[28,2,29,2],[28,3,29,3],[28,5,29,5],[34,0,35,0],[34,1,35,1],[34,2,35,2],[34,3,35,3],[34,5,35,5],[32,0,33,0],[32,1,33,1],[32,2,33,2],[32,3,33,3],[32,5,33,5],[41,0,42,0],[41,1,42,1],[41,2,42,2],[41,3,42,3],[41,5,42,5],[43,0,44,0],[43,1,44,1],[43,2,44,2],[43,3,44,3],[43,5,44,5],[45,0,46,0],[45,1,46,1],[45,2,46,2],[45,3,46,3],[45,5,46,5],[47,0,48,0],[47,1,48,1],[47,2,48,2],[47,3,48,3],[47,5,48,5],[49,0,50,0],[49,1,50,1],[49,2,50,2],[49,3,50,3],[49,5,50,5],[51,0,52,0],[51,1,52,1],[51,2,52,2],[51,3,52,3],[51,5,52,5],[59,3,60,3],[59,5,60,5],[53,0,54,0],[53,1,54,1],[53,2,54,2],[53,3,54,3],[53,5,54,5],[55,0,56,0],[55,1,56,1],[55,2,56,2],[55,3,56,3],[55,5,56,5],[37,2,37,5],[39,0,40,0],[39,1,40,1],[39,2,40,2],[39,3,40,3],[39,5,40,5],[70,2,70,5],[61,0,62,0],[61,1,62,1],[61,2,62,2],[61,3,62,3],[61,5,62,5],[63,0,64,0],[63,1,64,1],[63,2,64,2],[63,3,64,3],[57,0,58,0],[57,1,58,1],[57,2,58,2],[57,3,58,3],[57,5,58,5],[59,0,60,0],[59,1,60,1],[59,2,60,2],[74,0,75,0],[74,1,75,1],[74,2,75,2],[74,3,75,3],[74,5,75,5],[72,0,73,0],[72,1,73,1],[72,2,73,2],[72,3,73,3],[72,5,73,5],[63,5,64,5],[65,0,66,0],[65,1,66,1],[65,2,66,2],[65,3,66,3],[65,5,66,5],[67,0,68,0],[67,1,68,1],[67,2,68,2],[67,3,68,3],[67,5,68,5],[76,0,77,0],[76,1,77,1],[76,2,77,2],[76,3,77,3],[76,5,77,5],[78,0,79,0],[78,1,79,1],[78,2,79,2],[78,3,79,3],[78,5,79,5],[80,0,81,0],[80,1,81,1],[80,2,81,2],[80,3,81,3],[80,5,81,5],[82,0,83,0],[82,1,83,1],[82,2,83,2],[82,3,83,3],[82,5,83,5],[84,0,85,0],[84,1,85,1],[84,2,85,2],[84,3,85,3],[84,5,85,5],[86,0,87,0],[86,1,87,1],[86,2,87,2],[86,3,87,3],[86,5,87,5],[88,0,89,0],[88,1,89,1],[88,2,89,2],[88,3,89,3],[88,5,89,5],[90,0,91,0],[90,1,91,1],[90,2,91,2],[90,3,91,3],[90,5,91,5],[92,0,93,0],[92,1,93,1],[92,2,93,2],[92,3,93,3],[92,5,93,5],[94,0,95,0],[94,1,95,1],[94,2,95,2],[94,3,95,3],[94,5,95,5],[96,0,97,0],[96,1,97,1],[96,2,97,2],[96,3,97,3],[96,5,97,5],[98,0,99,0],[98,1,99,1],[98,2,99,2],[98,3,99,3],[98,5,99,5],[100,0,101,0],[100,1,101,1],[100,2,101,2],[100,3,101,3],[100,5,101,5],[103,2,103,5],[105,0,106,0],[105,1,106,1],[105,2,106,2],[105,3,106,3],[105,5,106,5],[107,0,108,0],[107,1,108,1],[107,2,108,2],[107,3,108,3],[107,5,108,5],[109,0,110,0],[109,1,110,1],[109,2,110,2],[109,3,110,3],[109,5,110,5],[111,0,112,0],[111,1,112,1],[111,2,112,2],[111,3,112,3],[111,5,112,5],[113,0,114,0],[113,1,114,1],[113,2,114,2],[113,3,114,3],[113,5,114,5],[115,0,116,0],[115,1,116,1],[115,2,116,2],[115,3,116,3],[115,5,116,5],[117,0,118,0],[117,1,118,1],[117,2,118,2],[117,3,118,3],[117,5,118,5],[119,0,120,0],[119,1,120,1],[119,2,120,2],[119,3,120,3],[119,5,120,5],[121,0,122,0],[121,1,122,1],[121,2,122,2],[121,3,122,3],[121,5,122,5],[123,0,124,0],[123,1,124,1],[123,2,124,2],[123,3,124,3],[123,5,124,5],[125,0,126,0],[125,1,126,1],[125,2,126,2],[125,3,126,3],[125,5,126,5],[127,0,128,0],[127,1,128,1],[127,2,128,2],[127,3,128,3],[127,5,128,5],[129,0,130,0],[129,1,130,1],[129,2,130,2],[129,3,130,3],[129,5,130,5],[131,0,132,0],[131,1,132,1],[131,2,132,2],[131,3,132,3],[131,5,132,5],[133,0,134,0],[133,1,134,1],[133,2,134,2],[133,3,134,3],[133,5,134,5],[136,2,136,5],[138,0,139,0],[138,1,139,1],[138,2,139,2],[138,3,139,3],[138,5,139,5],[140,0,141,0],[140,1,141,1],[140,2,141,2],[140,3,141,3],[140,5,141,5],[142,0,143,0],[142,1,143,1],[142,2,143,2],[142,3,143,3],[142,5,143,5],[144,0,145,0],[144,1,145,1],[144,2,145,2],[144,3,145,3],[144,5,145,5],[146,0,147,0],[146,1,147,1],[146,2,147,2],[146,3,147,3],[146,5,147,5],[148,0,149,0],[148,1,149,1],[148,2,149,2],[148,3,149,3],[148,5,149,5],[150,0,151,0],[150,1,151,1],[150,2,151,2],[150,3,151,3],[150,5,151,5],[152,0,153,0],[152,1,153,1],[152,2,153,2],[152,3,153,3],[152,5,153,5],[154,0,155,0],[154,1,155,1],[154,2,155,2],[154,3,155,3],[154,5,155,5],[156,0,157,0],[156,1,157,1],[156,2,157,2],[156,3,157,3],[156,5,157,5],[158,0,159,0],[158,1,159,1],[158,2,159,2],[158,3,159,3],[158,5,159,5],[160,0,161,0],[160,1,161,1],[160,2,161,2],[160,3,161,3],[160,5,161,5],[162,0,163,0],[162,1,163,1],[162,2,163,2],[162,3,163,3],[162,5,163,5],[164,0,165,0],[164,1,165,1],[164,2,165,2],[164,3,165,3],[164,5,165,5],[166,0,167,0],[166,1,167,1],[166,2,167,2],[166,3,167,3],[166,5,167,5],[169,2,169,5],[171,0,172,0],[171,1,172,1],[171,2,172,2],[171,3,172,3],[171,5,172,5],[173,0,174,0],[173,1,174,1],[173,2,174,2],[173,3,174,3],[173,5,174,5],[175,0,176,0],[175,1,176,1],[175,2,176,2],[175,3,176,3],[175,5,176,5],[177,0,178,0],[177,1,178,1],[177,2,178,2],[177,3,178,3],[177,5,178,5],[179,0,180,0],[179,1,180,1],[179,2,180,2],[179,3,180,3],[179,5,180,5],[181,0,182,0],[181,1,182,1],[181,2,182,2],[181,3,182,3],[181,5,182,5],[183,0,184,0],[183,1,184,1],[183,2,184,2],[183,3,184,3],[183,5,184,5],[185,0,186,0],[185,1,186,1],[185,2,186,2],[185,3,186,3],[185,5,186,5],[187,0,188,0],[187,1,188,1],[187,2,188,2],[187,3,188,3],[187,5,188,5],[189,1,190,1],[189,2,190,2],[189,3,190,3],[189,5,190,5],[191,0,192,0],[191,1,192,1],[191,2,192,2],[191,3,192,3],[191,5,192,5],[0,3,0,4],[1,3,1,4],[2,3,2,4],[197,0,198,0],[197,1,198,1],[197,2,198,2],[197,3,198,3],[197,5,198,5],[199,0,200,0],[199,1,200,1],[199,2,200,2],[199,3,200,3],[199,5,200,5],[193,0,194,0],[193,1,194,1],[193,2,194,2],[193,3,194,3],[193,5,194,5],[195,0,196,0],[195,1,196,1],[195,2,196,2],[195,3,196,3],[195,5,196,5],[189,0,190,0]]}
["Wettkampfbogen",null,"Ort / Datum :",{"$f":"'INFO Blatt'!B11","v":"Hehlen"},null,{"$f":"'INFO Blatt'!B13","v":"2018-03-03"}]
[null,null,"Mannschaft:",{"$f":"Formeln!A7","v":"TG Oker Salzgitter 1"},null,"Wertungsvorschriften"]
[null,null,"Liga:",{"$f":"'INFO Blatt'!B7","v":"Schülerliga Süd"},null,{"$f":"'INFO Blatt'!B5","v":"P-Stufen"}]
[]
["Name","Jg","Boden"]
[null,null,"D-Note","Abzug OK","E- Abzug","Note"]
["Nils Honisch","04"]
[]
["Tim Honisch","06"]
[]
["Jarik Siebold","06"]
[]
["Robert Knoke","05"]
[]
["Leon Müller","05"]
[]
["Jannis Volkmer","05"]
[]
["Christian Rath","06"]
[]
[]
[]
[]
[]
[]
[]
[]
[]
[]
[]
[]
[]
[]
[]
[]
[]
[]
["Name","Jg","Pauschenpferd"]
[null,null,"D-Note","Abzug OK","E- Abzug","Note"]
[{"$f":"IF(A7>0,A7,\"\")","v":"Nils Honisch"},{"$f":"IF(B7>0,B7,\"\")","v":"04"}]
[]
[{"$f":"IF(A9>0,A9,\"\")","v":"Tim Honisch"},"06"]
[]
[{"$f":"IF(A11>0,A11,\"\")","v":"Jarik Siebold"},"06"]
[]
[{"$f":"IF(A13>0,A13,\"\")","v":"Robert Knoke"},"05"]
[]
[{"$f":"IF(A15>0,A15,\"\")","v":"Leon Müller"},"05"]
[]
[{"$f":"IF(A17>0,A17,\"\")","v":"Jannis Volkmer"},"05"]
[]
[{"$f":"IF(#REF!>0,#REF!,\"\")","v":{"$error":"#REF!"}},{"$f":"IF(#REF!>0,#REF!,\"\")","v":{"$error":"#REF!"}}]
[]
[{"$f":"IF(A21>0,A21,\"\")","v":""},""]
[]
[{"$f":"IF(A23>0,A23,\"\")","v":""},""]
[]
[{"$f":"IF(A25>0,A25,\"\")","v":""},""]
[]
[{"$f":"IF(A27>0,A27,\"\")","v":""},""]
[]
[{"$f":"IF(A29>0,A29,\"\")","v":""},""]
[]
[{"$f":"IF(A31>0,A31,\"\")","v":""},""]
[]
[{"$f":"IF(A33>0,A33,\"\")","v":""},""]
[]
[{"$f":"IF(A35>0,A35,\"\")","v":""},""]
[]
[]
["Name","Jg","Ringe"]
[null,null,"D-Note","Abzug OK","E- Abzug","Note"]
[{"$f":"IF(A40>0,A40,\"\")","v":"Nils Honisch"},{"$f":"IF(B40>0,B40,\"\")","v":"04"}]
[]
[{"$f":"IF(A42>0,A42,\"\")","v":"Tim Honisch"},"06"]
[]
[{"$f":"IF(A44>0,A44,\"\")","v":"Jarik Siebold"},"06"]
[]
[{"$f":"IF(A46>0,A46,\"\")","v":"Robert Knoke"},"05"]
[]
[{"$f":"IF(A48>0,A48,\"\")","v":"Leon Müller"},"05"]
[]
[{"$f":"IF(A50>0,A50,\"\")","v":"Jannis Volkmer"},"05"]
[]
[{"$f":"IF(A52>0,A52,\"\")","v":{"$error":"#REF!"}},{"$error":"#REF!"}]
[]
[{"$f":"IF(A54>0,A54,\"\")","v":""},""]
[]
[{"$f":"IF(A56>0,A56,\"\")","v":""},""]
[]
[{"$f":"IF(A58>0,A58,\"\")","v":""},""]
[]
[{"$f":"IF(A60>0,A60,\"\")","v":""},""]
[]
[{"$f":"IF(A62>0,A62,\"\")","v":""},""]
[]
[{"$f":"IF(A64>0,A64,\"\")","v":""},""]
[]
[{"$f":"IF(A66>0,A66,\"\")","v":""},""]
[]
[{"$f":"IF(A68>0,A68,\"\")","v":""},""]
[]
[]
["Name","Jg","Sprung"]
[null,null,"D-Note","Abzug OK","E- Abzug","Note"]
[{"$f":"IF(A73>0,A73,\"\")","v":"Nils Honisch"},{"$f":"IF(B73>0,B73,\"\")","v":"04"}]
[]
[{"$f":"IF(A75>0,A75,\"\")","v":"Tim Honisch"},"06"]
[]
[{"$f":"IF(A77>0,A77,\"\")","v":"Jarik Siebold"},"06"]
[]
[{"$f":"IF(A79>0,A79,\"\")","v":"Robert Knoke"},"05"]
[]
[{"$f":"IF(A81>0,A81,\"\")","v":"Leon Müller"},"05"]
[]
[{"$f":"IF(A83>0,A83,\"\")","v":"Jannis Volkmer"},"05"]
[]
[{"$f":"IF(A85>0,A85,\"\")","v":{"$error":"#REF!"}},{"$error":"#REF!"}]
[]
[{"$f":"IF(A87>0,A87,\"\")","v":""},""]
[]
[{"$f":"IF(A89>0,A89,\"\")","v":""},""]
[]
[{"$f":"IF(A91>0,A91,\"\")","v":""},""]
[]
[{"$f":"IF(A93>0,A93,\"\")","v":""},""]
[]
[{"$f":"IF(A95>0,A95,\"\")","v":""},""]
[]
[{"$f":"IF(A97>0,A97,\"\")","v":""},""]
[]
[{"$f":"IF(A99>0,A99,\"\")","v":""},""]
[]
[{"$f":"IF(A101>0,A101,\"\")","v":""},""]
[]
[]
["Name","Jg","Barren"]
[null,null,"D-Note","Abzug OK","E- Abzug","Note"]
[{"$f":"IF(A106>0,A106,\"\")","v":"Nils Honisch"},{"$f":"IF(B106>0,B106,\"\")","v":"04"}]
[]
[{"$f":"IF(A108>0,A108,\"\")","v":"Tim Honisch"},"06"]
[]
[{"$f":"IF(A110>0,A110,\"\")","v":"Jarik Siebold"},"06"]
[]
[{"$f":"IF(A112>0,A112,\"\")","v":"Robert Knoke"},"05"]
[]
[{"$f":"IF(A114>0,A114,\"\")","v":"Leon Müller"},"05"]
[]
[{"$f":"IF(A116>0,A116,\"\")","v":"Jannis Volkmer"},"05"]
[]
[{"$f":"IF(A118>0,A118,\"\")","v":{"$error":"#REF!"}},{"$error":"#REF!"}]
[]
[{"$f":"IF(A120>0,A120,\"\")","v":""},""]
[]
[{"$f":"IF(A122>0,A122,\"\")","v":""},""]
[]
[{"$f":"IF(A124>0,A124,\"\")","v":""},""]
[]
[{"$f":"IF(A126>0,A126,\"\")","v":""},""]
[]
[{"$f":"IF(A128>0,A128,\"\")","v":""},""]
[]
[{"$f":"IF(A130>0,A130,\"\")","v":""},""]
[]
[{"$f":"IF(A132>0,A132,\"\")","v":""},""]
[]
[{"$f":"IF(A134>0,A134,\"\")","v":""},""]
[]
[]
["Name","Jg","Reck"]
[null,null,"D-Note","Abzug OK","E- Abzug","Note"]
[{"$f":"IF(A139>0,A139,\"\")","v":"Nils Honisch"},{"$f":"IF(B139>0,B139,\"\")","v":"04"}]
[]
[{"$f":"IF(A141>0,A141,\"\")","v":"Tim Honisch"},"06"]
[]
[{"$f":"IF(A143>0,A143,\"\")","v":"Jarik Siebold"},"06"]
[]
[{"$f":"IF(A145>0,A145,\"\")","v":"Robert Knoke"},"05"]
[]
[{"$f":"IF(A147>0,A147,\"\")","v":"Leon Müller"},"05"]
[]
[{"$f":"IF(A149>0,A149,\"\")","v":"Jannis Volkmer"},"05"]
[]
[{"$f":"IF(A151>0,A151,\"\")","v":{"$error":"#REF!"}},{"$error":"#REF!"}]
[]
[{"$f":"IF(A153>0,A153,\"\")","v":""},""]
[]
[{"$f":"IF(A155>0,A155,\"\")","v":""},""]
[]
[{"$f":"IF(A157>0,A157,\"\")","v":""},""]
[]
[{"$f":"IF(A159>0,A159,\"\")","v":""},""]
[]
[{"$f":"IF(A161>0,A161,\"\")","v":""},""]
[]
[{"$f":"IF(A163>0,A163,\"\")","v":""},""]
[]
[{"$f":"IF(A165>0,A165,\"\")","v":""},""]
[]
[{"$f":"IF(A167>0,A167,\"\")","v":""},""]

{"sheet":"Wertungszettel M4","index":17,"n_rows":200,"n_cols":6,"rows_kept":200,"cut":false,"hidden":false,"merged":[[4,2,4,5],[8,0,9,0],[8,1,9,1],[8,2,9,2],[8,3,9,3],[8,5,9,5],[6,0,7,0],[6,1,7,1],[6,2,7,2],[6,3,7,3],[6,5,7,5],[12,0,13,0],[12,1,13,1],[12,2,13,2],[12,3,13,3],[12,5,13,5],[10,0,11,0],[10,1,11,1],[10,2,11,2],[10,3,11,3],[10,5,11,5],[16,0,17,0],[16,1,17,1],[16,2,17,2],[16,3,17,3],[16,5,17,5],[14,0,15,0],[14,1,15,1],[14,2,15,2],[14,3,15,3],[14,5,15,5],[20,0,21,0],[20,1,21,1],[20,2,21,2],[20,3,21,3],[20,5,21,5],[18,0,19,0],[18,1,19,1],[18,2,19,2],[18,3,19,3],[18,5,19,5],[24,0,25,0],[24,1,25,1],[24,2,25,2],[24,3,25,3],[24,5,25,5],[22,0,23,0],[22,1,23,1],[22,2,23,2],[22,3,23,3],[22,5,23,5],[28,0,29,0],[28,1,29,1],[28,2,29,2],[28,3,29,3],[28,5,29,5],[26,0,27,0],[26,1,27,1],[26,2,27,2],[26,3,27,3],[26,5,27,5],[32,0,33,0],[32,1,33,1],[32,2,33,2],[32,3,33,3],[32,5,33,5],[30,0,31,0],[30,1,31,1],[30,2,31,2],[30,3,31,3],[30,5,31,5],[39,0,40,0],[39,1,40,1],[39,2,40,2],[39,3,40,3],[39,5,40,5],[37,2,37,5],[34,0,35,0],[34,1,35,1],[34,2,35,2],[34,3,35,3],[34,5,35,5],[43,0,44,0],[43,1,44,1],[43,2,44,2],[43,3,44,3],[43,5,44,5],[41,0,42,0],[41,1,42,1],[41,2,42,2],[41,3,42,3],[41,5,42,5],[47,0,48,0],[47,1,48,1],[47,2,48,2],[47,3,48,3],[47,5,48,5],[45,0,46,0],[45,1,46,1],[45,2,46,2],[45,3,46,3],[45,5,46,5],[51,0,52,0],[51,1,52,1],[51,2,52,2],[51,3,52,3],[51,5,52,5],[49,0,50,0],[49,1,50,1],[49,2,50,2],[49,3,50,3],[49,5,50,5],[55,0,56,0],[55,1,56,1],[55,2,56,2],[55,3,56,3],[55,5,56,5],[53,0,54,0],[53,1,54,1],[53,2,54,2],[53,3,54,3],[53,5,54,5],[59,0,60,0],[59,1,60,1],[59,2,60,2],[59,3,60,3],[59,5,60,5],[57,0,58,0],[57,1,58,1],[57,2,58,2],[57,3,58,3],[57,5,58,5],[63,0,64,0],[63,1,64,1],[63,2,64,2],[63,3,64,3],[63,5,64,5],[61,0,62,0],[61,1,62,1],[61,2,62,2],[61,3,62,3],[61,5,62,5],[67,0,68,0],[67,1,68,1],[67,2,68,2],[67,3,68,3],[67,5,68,5],[65,0,66,0],[65,1,66,1],[65,2,66,2],[65,3,66,3],[65,5,66,5],[70,2,70,5],[72,0,73,0],[72,1,73,1],[72,2,73,2],[72,3,73,3],[72,5,73,5],[74,0,75,0],[74,1,75,1],[74,2,75,2],[74,3,75,3],[74,5,75,5],[76,0,77,0],[76,1,77,1],[76,2,77,2],[76,3,77,3],[76,5,77,5],[78,0,79,0],[78,1,79,1],[78,2,79,2],[78,3,79,3],[78,5,79,5],[80,0,81,0],[80,1,81,1],[80,2,81,2],[80,3,81,3],[80,5,81,5],[82,0,83,0],[82,1,83,1],[82,2,83,2],[82,3,83,3],[82,5,83,5],[84,0,85,0],[84,1,85,1],[84,2,85,2],[84,3,85,3],[84,5,85,5],[86,0,87,0],[86,1,87,1],[86,2,87,2],[86,3,87,3],[86,5,87,5],[88,0,89,0],[88,1,89,1],[88,2,89,2],[88,3,89,3],[88,5,89,5],[90,0,91,0],[90,1,91,1],[90,2,91,2],[90,3,91,3],[90,5,91,5],[92,0,93,0],[92,1,93,1],[92,2,93,2],[92,3,93,3],[92,5,93,5],[94,0,95,0],[94,1,95,1],[94,2,95,2],[94,3,95,3],[94,5,95,5],[96,0,97,0],[96,1,97,1],[96,2,97,2],[96,3,97,3],[96,5,97,5],[98,0,99,0],[98,1,99,1],[98,2,99,2],[98,3,99,3],[98,5,99,5],[100,0,101,0],[100,1,101,1],[100,2,101,2],[100,3,101,3],[100,5,101,5],[103,2,103,5],[105,0,106,0],[105,1,106,1],[105,2,106,2],[105,3,106,3],[105,5,106,5],[107,0,108,0],[107,1,108,1],[107,2,108,2],[107,3,108,3],[107,5,108,5],[109,0,110,0],[109,1,110,1],[109,2,110,2],[109,3,110,3],[109,5,110,5],[111,0,112,0],[111,1,112,1],[111,2,112,2],[111,3,112,3],[111,5,112,5],[113,0,114,0],[113,1,114,1],[113,2,114,2],[113,3,114,3],[113,5,114,5],[115,0,116,0],[115,1,116,1],[115,2,116,2],[115,3,116,3],[115,5,116,5],[117,0,118,0],[117,1,118,1],[117,2,118,2],[117,3,118,3],[117,5,118,5],[119,0,120,0],[119,1,120,1],[119,2,120,2],[119,3,120,3],[119,5,120,5],[121,0,122,0],[121,1,122,1],[121,2,122,2],[121,3,122,3],[121,5,122,5],[123,0,124,0],[123,1,124,1],[123,2,124,2],[123,3,124,3],[123,5,124,5],[125,0,126,0],[125,1,126,1],[125,2,126,2],[125,3,126,3],[125,5,126,5],[127,0,128,0],[127,1,128,1],[127,2,128,2],[127,3,128,3],[127,5,128,5],[129,0,130,0],[129,1,130,1],[129,2,130,2],[129,3,130,3],[129,5,130,5],[131,0,132,0],[131,1,132,1],[131,2,132,2],[131,3,132,3],[131,5,132,5],[133,0,134,0],[133,1,134,1],[133,2,134,2],[133,3,134,3],[133,5,134,5],[136,2,136,5],[138,0,139,0],[138,1,139,1],[138,2,139,2],[138,3,139,3],[138,5,139,5],[140,0,141,0],[140,1,141,1],[140,2,141,2],[140,3,141,3],[140,5,141,5],[142,0,143,0],[142,1,143,1],[142,2,143,2],[142,3,143,3],[142,5,143,5],[144,0,145,0],[144,1,145,1],[144,2,145,2],[144,3,145,3],[144,5,145,5],[146,0,147,0],[146,1,147,1],[146,2,147,2],[146,3,147,3],[146,5,147,5],[148,0,149,0],[148,1,149,1],[148,2,149,2],[148,3,149,3],[148,5,149,5],[150,0,151,0],[150,1,151,1],[150,2,151,2],[150,3,151,3],[150,5,151,5],[152,0,153,0],[152,1,153,1],[152,2,153,2],[152,3,153,3],[152,5,153,5],[154,0,155,0],[154,1,155,1],[154,2,155,2],[154,3,155,3],[154,5,155,5],[156,0,157,0],[156,1,157,1],[156,2,157,2],[156,3,157,3],[156,5,157,5],[158,0,159,0],[158,1,159,1],[158,2,159,2],[158,3,159,3],[158,5,159,5],[160,0,161,0],[160,1,161,1],[160,2,161,2],[160,3,161,3],[160,5,161,5],[162,0,163,0],[162,1,163,1],[162,2,163,2],[162,3,163,3],[162,5,163,5],[164,0,165,0],[164,1,165,1],[164,2,165,2],[164,3,165,3],[164,5,165,5],[166,0,167,0],[166,1,167,1],[166,2,167,2],[166,3,167,3],[166,5,167,5],[169,2,169,5],[171,0,172,0],[171,1,172,1],[171,2,172,2],[171,3,172,3],[171,5,172,5],[173,0,174,0],[173,1,174,1],[173,2,174,2],[173,3,174,3],[173,5,174,5],[175,0,176,0],[175,1,176,1],[175,2,176,2],[175,3,176,3],[175,5,176,5],[177,0,178,0],[177,1,178,1],[177,2,178,2],[177,3,178,3],[177,5,178,5],[179,0,180,0],[179,1,180,1],[179,2,180,2],[179,3,180,3],[179,5,180,5],[181,0,182,0],[181,1,182,1],[181,2,182,2],[181,3,182,3],[181,5,182,5],[183,0,184,0],[183,1,184,1],[183,2,184,2],[183,3,184,3],[183,5,184,5],[185,0,186,0],[185,1,186,1],[185,2,186,2],[185,3,186,3],[185,5,186,5],[187,0,188,0],[187,1,188,1],[187,2,188,2],[187,3,188,3],[187,5,188,5],[189,1,190,1],[189,2,190,2],[189,3,190,3],[189,5,190,5],[191,0,192,0],[191,1,192,1],[191,2,192,2],[191,3,192,3],[191,5,192,5],[0,3,0,4],[1,3,1,4],[2,3,2,4],[197,0,198,0],[197,1,198,1],[197,2,198,2],[197,3,198,3],[197,5,198,5],[199,0,200,0],[199,1,200,1],[199,2,200,2],[199,3,200,3],[199,5,200,5],[193,0,194,0],[193,1,194,1],[193,2,194,2],[193,3,194,3],[193,5,194,5],[195,0,196,0],[195,1,196,1],[195,2,196,2],[195,3,196,3],[195,5,196,5],[189,0,190,0]]}
["Wettkampfbogen",null,"Ort / Datum :",{"$f":"'INFO Blatt'!B11","v":"Hehlen"},null,{"$f":"'INFO Blatt'!B13","v":"2018-03-03"}]
[null,null,"Mannschaft:",{"$f":"Formeln!A8","v":"TG Oker Salzgitter 2"},null,"Wertungsvorschriften"]
[null,null,"Liga:",{"$f":"'INFO Blatt'!B7","v":"Schülerliga Süd"},null,{"$f":"'INFO Blatt'!B5","v":"P-Stufen"}]
[]
["Name","Jg","Boden"]
[null,null,"D-Note","Abzug OK","E- Abzug","Note"]
["Patrick Gernowski","04"]
[]
["Jamie Schnabel","05"]
[]
["Emmanuel Taube","05"]
[]
["Eric Siebenhaar","07"]
[]
["Lasse Sticka","07"]
[]
[]
[]
["Samuel Treu","04"]
[]
["Furkan Temizyürek","05"]
[]
[]
[]
[]
[]
[]
[]
[]
[]
[]
[]
[]
[]
[]
[]
[]
["Name","Jg","Pauschenpferd"]
[null,null,"D-Note","Abzug OK","E- Abzug","Note"]
[{"$f":"IF(A7>0,A7,\"\")","v":"Patrick Gernowski"},{"$f":"IF(B7>0,B7,\"\")","v":"04"}]
[]
[{"$f":"IF(A9>0,A9,\"\")","v":"Jamie Schnabel"},"05"]
[]
[{"$f":"IF(A11>0,A11,\"\")","v":"Emmanuel Taube"},"05"]
[]
[{"$f":"IF(A13>0,A13,\"\")","v":"Eric Siebenhaar"},"07"]
[]
[{"$f":"IF(A15>0,A15,\"\")","v":"Lasse Sticka"},"07"]
[]
[{"$f":"IF('Wertungszettel M3'!A19>0,'Wertungszettel M3'!A19,\"\")","v":"Christian Rath"},{"$f":"IF('Wertungszettel M3'!B19>0,'Wertungszettel M3'!B19,\"\")","v":"06"}]
[]
[{"$f":"IF(A19>0,A19,\"\")","v":"Samuel Treu"},"04"]
[]
[{"$f":"IF(A21>0,A21,\"\")","v":"Furkan Temizyürek"},"05"]
[]
[{"$f":"IF(A23>0,A23,\"\")","v":""},""]
[]
[{"$f":"IF(A25>0,A25,\"\")","v":""},""]
[]
[{"$f":"IF(A27>0,A27,\"\")","v":""},""]
[]
[{"$f":"IF(A29>0,A29,\"\")","v":""},""]
[]
[{"$f":"IF(A31>0,A31,\"\")","v":""},""]
[]
[{"$f":"IF(A33>0,A33,\"\")","v":""},""]
[]
[{"$f":"IF(A35>0,A35,\"\")","v":""},""]
[]
[]
["Name","Jg","Ringe"]
[null,null,"D-Note","Abzug OK","E- Abzug","Note"]
[{"$f":"IF(A40>0,A40,\"\")","v":"Patrick Gernowski"},{"$f":"IF(B40>0,B40,\"\")","v":"04"}]
[]
[{"$f":"IF(A42>0,A42,\"\")","v":"Jamie Schnabel"},"05"]
[]
[{"$f":"IF(A44>0,A44,\"\")","v":"Emmanuel Taube"},"05"]
[]
[{"$f":"IF(A46>0,A46,\"\")","v":"Eric Siebenhaar"},"07"]
[]
[{"$f":"IF(A48>0,A48,\"\")","v":"Lasse Sticka"},"07"]
[]
[{"$f":"IF(A50>0,A50,\"\")","v":"Christian Rath"},"06"]
[]
[{"$f":"IF(A52>0,A52,\"\")","v":"Samuel Treu"},"04"]
[]
[{"$f":"IF(A54>0,A54,\"\")","v":"Furkan Temizyürek"},"05"]
[]
[{"$f":"IF(A56>0,A56,\"\")","v":""},""]
[]
[{"$f":"IF(A58>0,A58,\"\")","v":""},""]
[]
[{"$f":"IF(A60>0,A60,\"\")","v":""},""]
[]
[{"$f":"IF(A62>0,A62,\"\")","v":""},""]
[]
[{"$f":"IF(A64>0,A64,\"\")","v":""},""]
[]
[{"$f":"IF(A66>0,A66,\"\")","v":""},""]
[]
[{"$f":"IF(A68>0,A68,\"\")","v":""},""]
[]
[]
["Name","Jg","Sprung"]
[null,null,"D-Note","Abzug OK","E- Abzug","Note"]
[{"$f":"IF(A73>0,A73,\"\")","v":"Patrick Gernowski"},{"$f":"IF(B73>0,B73,\"\")","v":"04"}]
[]
[{"$f":"IF(A75>0,A75,\"\")","v":"Jamie Schnabel"},"05"]
[]
[{"$f":"IF(A77>0,A77,\"\")","v":"Emmanuel Taube"},"05"]
[]
[{"$f":"IF(A79>0,A79,\"\")","v":"Eric Siebenhaar"},"07"]
[]
[{"$f":"IF(A81>0,A81,\"\")","v":"Lasse Sticka"},"07"]
[]
[{"$f":"IF(A83>0,A83,\"\")","v":"Christian Rath"},"06"]
[]
[{"$f":"IF(A85>0,A85,\"\")","v":"Samuel Treu"},"04"]
[]
[{"$f":"IF(A87>0,A87,\"\")","v":"Furkan Temizyürek"},"05"]
[]
[{"$f":"IF(A89>0,A89,\"\")","v":""},""]
[]
[{"$f":"IF(A91>0,A91,\"\")","v":""},""]
[]
[{"$f":"IF(A93>0,A93,\"\")","v":""},""]
[]
[{"$f":"IF(A95>0,A95,\"\")","v":""},""]
[]
[{"$f":"IF(A97>0,A97,\"\")","v":""},""]
[]
[{"$f":"IF(A99>0,A99,\"\")","v":""},""]
[]
[{"$f":"IF(A101>0,A101,\"\")","v":""},""]
[]
[]
["Name","Jg","Barren"]
[null,null,"D-Note","Abzug OK","E- Abzug","Note"]
[{"$f":"IF(A106>0,A106,\"\")","v":"Patrick Gernowski"},{"$f":"IF(B106>0,B106,\"\")","v":"04"}]
[]
[{"$f":"IF(A108>0,A108,\"\")","v":"Jamie Schnabel"},"05"]
[]
[{"$f":"IF(A110>0,A110,\"\")","v":"Emmanuel Taube"},"05"]
[]
[{"$f":"IF(A112>0,A112,\"\")","v":"Eric Siebenhaar"},"07"]
[]
[{"$f":"IF(A114>0,A114,\"\")","v":"Lasse Sticka"},"07"]
[]
[{"$f":"IF(A116>0,A116,\"\")","v":"Christian Rath"},"06"]
[]
[{"$f":"IF(A118>0,A118,\"\")","v":"Samuel Treu"},"04"]
[]
[{"$f":"IF(A120>0,A120,\"\")","v":"Furkan Temizyürek"},"05"]
[]
[{"$f":"IF(A122>0,A122,\"\")","v":""},""]
[]
[{"$f":"IF(A124>0,A124,\"\")","v":""},""]
[]
[{"$f":"IF(A126>0,A126,\"\")","v":""},""]
[]
[{"$f":"IF(A128>0,A128,\"\")","v":""},""]
[]
[{"$f":"IF(A130>0,A130,\"\")","v":""},""]
[]
[{"$f":"IF(A132>0,A132,\"\")","v":""},""]
[]
[{"$f":"IF(A134>0,A134,\"\")","v":""},""]
[]
[]
["Name","Jg","Reck"]
[null,null,"D-Note","Abzug OK","E- Abzug","Note"]
[{"$f":"IF(A139>0,A139,\"\")","v":"Patrick Gernowski"},{"$f":"IF(B139>0,B139,\"\")","v":"04"}]
[]
[{"$f":"IF(A141>0,A141,\"\")","v":"Jamie Schnabel"},"05"]
[]
[{"$f":"IF(A143>0,A143,\"\")","v":"Emmanuel Taube"},"05"]
[]
[{"$f":"IF(A145>0,A145,\"\")","v":"Eric Siebenhaar"},"07"]
[]
[{"$f":"IF(A147>0,A147,\"\")","v":"Lasse Sticka"},"07"]
[]
[{"$f":"IF(A149>0,A149,\"\")","v":"Christian Rath"},"06"]
[]
[{"$f":"IF(A151>0,A151,\"\")","v":"Samuel Treu"},"04"]
[]
[{"$f":"IF(A153>0,A153,\"\")","v":"Furkan Temizyürek"},"05"]
[]
[{"$f":"IF(A155>0,A155,\"\")","v":""},""]
[]
[{"$f":"IF(A157>0,A157,\"\")","v":""},""]
[]
[{"$f":"IF(A159>0,A159,\"\")","v":""},""]
[]
[{"$f":"IF(A161>0,A161,\"\")","v":""},""]
[]
[{"$f":"IF(A163>0,A163,\"\")","v":""},""]
[]
[{"$f":"IF(A165>0,A165,\"\")","v":""},""]
[]
[{"$f":"IF(A167>0,A167,\"\")","v":""},""]

{"sheet":"Wertungszettel M5","index":18,"n_rows":200,"n_cols":6,"rows_kept":200,"cut":false,"hidden":false,"merged":[[4,2,4,5],[8,0,9,0],[8,1,9,1],[8,2,9,2],[8,3,9,3],[8,5,9,5],[6,0,7,0],[6,1,7,1],[6,2,7,2],[6,3,7,3],[6,5,7,5],[12,0,13,0],[12,1,13,1],[12,2,13,2],[12,3,13,3],[12,5,13,5],[10,0,11,0],[10,1,11,1],[10,2,11,2],[10,3,11,3],[10,5,11,5],[16,0,17,0],[16,1,17,1],[16,2,17,2],[16,3,17,3],[16,5,17,5],[14,0,15,0],[14,1,15,1],[14,2,15,2],[14,3,15,3],[14,5,15,5],[20,0,21,0],[20,1,21,1],[20,2,21,2],[20,3,21,3],[20,5,21,5],[18,0,19,0],[18,1,19,1],[18,2,19,2],[18,3,19,3],[18,5,19,5],[24,0,25,0],[24,1,25,1],[24,2,25,2],[24,3,25,3],[24,5,25,5],[22,0,23,0],[22,1,23,1],[22,2,23,2],[22,3,23,3],[22,5,23,5],[28,0,29,0],[28,1,29,1],[28,2,29,2],[28,3,29,3],[28,5,29,5],[26,0,27,0],[26,1,27,1],[26,2,27,2],[26,3,27,3],[26,5,27,5],[32,0,33,0],[32,1,33,1],[32,2,33,2],[32,3,33,3],[32,5,33,5],[30,0,31,0],[30,1,31,1],[30,2,31,2],[30,3,31,3],[30,5,31,5],[39,0,40,0],[39,1,40,1],[39,2,40,2],[39,3,40,3],[39,5,40,5],[37,2,37,5],[34,0,35,0],[34,1,35,1],[34,2,35,2],[34,3,35,3],[34,5,35,5],[43,0,44,0],[43,1,44,1],[43,2,44,2],[43,3,44,3],[43,5,44,5],[41,0,42,0],[41,1,42,1],[41,2,42,2],[41,3,42,3],[41,5,42,5],[47,0,48,0],[47,1,48,1],[47,2,48,2],[47,3,48,3],[47,5,48,5],[45,0,46,0],[45,1,46,1],[45,2,46,2],[45,3,46,3],[45,5,46,5],[51,0,52,0],[51,1,52,1],[51,2,52,2],[51,3,52,3],[51,5,52,5],[49,0,50,0],[49,1,50,1],[49,2,50,2],[49,3,50,3],[49,5,50,5],[55,0,56,0],[55,1,56,1],[55,2,56,2],[55,3,56,3],[55,5,56,5],[53,0,54,0],[53,1,54,1],[53,2,54,2],[53,3,54,3],[53,5,54,5],[59,0,60,0],[59,1,60,1],[59,2,60,2],[59,3,60,3],[59,5,60,5],[57,0,58,0],[57,1,58,1],[57,2,58,2],[57,3,58,3],[57,5,58,5],[63,0,64,0],[63,1,64,1],[63,2,64,2],[63,3,64,3],[63,5,64,5],[61,0,62,0],[61,1,62,1],[61,2,62,2],[61,3,62,3],[61,5,62,5],[67,0,68,0],[67,1,68,1],[67,2,68,2],[67,3,68,3],[67,5,68,5],[65,0,66,0],[65,1,66,1],[65,2,66,2],[65,3,66,3],[65,5,66,5],[70,2,70,5],[72,0,73,0],[72,1,73,1],[72,2,73,2],[72,3,73,3],[72,5,73,5],[74,0,75,0],[74,1,75,1],[74,2,75,2],[74,3,75,3],[74,5,75,5],[76,0,77,0],[76,1,77,1],[76,2,77,2],[76,3,77,3],[76,5,77,5],[78,0,79,0],[78,1,79,1],[78,2,79,2],[78,3,79,3],[78,5,79,5],[80,0,81,0],[80,1,81,1],[80,2,81,2],[80,3,81,3],[80,5,81,5],[82,0,83,0],[82,1,83,1],[82,2,83,2],[82,3,83,3],[82,5,83,5],[84,0,85,0],[84,1,85,1],[84,2,85,2],[84,3,85,3],[84,5,85,5],[86,0,87,0],[86,1,87,1],[86,2,87,2],[86,3,87,3],[86,5,87,5],[88,0,89,0],[88,1,89,1],[88,2,89,2],[88,3,89,3],[88,5,89,5],[90,0,91,0],[90,1,91,1],[90,2,91,2],[90,3,91,3],[90,5,91,5],[92,0,93,0],[92,1,93,1],[92,2,93,2],[92,3,93,3],[92,5,93,5],[94,0,95,0],[94,1,95,1],[94,2,95,2],[94,3,95,3],[94,5,95,5],[96,0,97,0],[96,1,97,1],[96,2,97,2],[96,3,97,3],[96,5,97,5],[98,0,99,0],[98,1,99,1],[98,2,99,2],[98,3,99,3],[98,5,99,5],[100,0,101,0],[100,1,101,1],[100,2,101,2],[100,3,101,3],[100,5,101,5],[103,2,103,5],[105,0,106,0],[105,1,106,1],[105,2,106,2],[105,3,106,3],[105,5,106,5],[107,0,108,0],[107,1,108,1],[107,2,108,2],[107,3,108,3],[107,5,108,5],[109,0,110,0],[109,1,110,1],[109,2,110,2],[109,3,110,3],[109,5,110,5],[111,0,112,0],[111,1,112,1],[111,2,112,2],[111,3,112,3],[111,5,112,5],[113,0,114,0],[113,1,114,1],[113,2,114,2],[113,3,114,3],[113,5,114,5],[115,0,116,0],[115,1,116,1],[115,2,116,2],[115,3,116,3],[115,5,116,5],[117,0,118,0],[117,1,118,1],[117,2,118,2],[117,3,118,3],[117,5,118,5],[119,0,120,0],[119,1,120,1],[119,2,120,2],[119,3,120,3],[119,5,120,5],[121,0,122,0],[121,1,122,1],[121,2,122,2],[121,3,122,3],[121,5,122,5],[123,0,124,0],[123,1,124,1],[123,2,124,2],[123,3,124,3],[123,5,124,5],[125,0,126,0],[125,1,126,1],[125,2,126,2],[125,3,126,3],[125,5,126,5],[127,0,128,0],[127,1,128,1],[127,2,128,2],[127,3,128,3],[127,5,128,5],[129,0,130,0],[129,1,130,1],[129,2,130,2],[129,3,130,3],[129,5,130,5],[131,0,132,0],[131,1,132,1],[131,2,132,2],[131,3,132,3],[131,5,132,5],[133,0,134,0],[133,1,134,1],[133,2,134,2],[133,3,134,3],[133,5,134,5],[136,2,136,5],[138,0,139,0],[138,1,139,1],[138,2,139,2],[138,3,139,3],[138,5,139,5],[140,0,141,0],[140,1,141,1],[140,2,141,2],[140,3,141,3],[140,5,141,5],[142,0,143,0],[142,1,143,1],[142,2,143,2],[142,3,143,3],[142,5,143,5],[144,0,145,0],[144,1,145,1],[144,2,145,2],[144,3,145,3],[144,5,145,5],[146,0,147,0],[146,1,147,1],[146,2,147,2],[146,3,147,3],[146,5,147,5],[148,0,149,0],[148,1,149,1],[148,2,149,2],[148,3,149,3],[148,5,149,5],[150,0,151,0],[150,1,151,1],[150,2,151,2],[150,3,151,3],[150,5,151,5],[152,0,153,0],[152,1,153,1],[152,2,153,2],[152,3,153,3],[152,5,153,5],[154,0,155,0],[154,1,155,1],[154,2,155,2],[154,3,155,3],[154,5,155,5],[156,0,157,0],[156,1,157,1],[156,2,157,2],[156,3,157,3],[156,5,157,5],[158,0,159,0],[158,1,159,1],[158,2,159,2],[158,3,159,3],[158,5,159,5],[160,0,161,0],[160,1,161,1],[160,2,161,2],[160,3,161,3],[160,5,161,5],[162,0,163,0],[162,1,163,1],[162,2,163,2],[162,3,163,3],[162,5,163,5],[164,0,165,0],[164,1,165,1],[164,2,165,2],[164,3,165,3],[164,5,165,5],[166,0,167,0],[166,1,167,1],[166,2,167,2],[166,3,167,3],[166,5,167,5],[169,2,169,5],[171,0,172,0],[171,1,172,1],[171,2,172,2],[171,3,172,3],[171,5,172,5],[173,0,174,0],[173,1,174,1],[173,2,174,2],[173,3,174,3],[173,5,174,5],[175,0,176,0],[175,1,176,1],[175,2,176,2],[175,3,176,3],[175,5,176,5],[177,0,178,0],[177,1,178,1],[177,2,178,2],[177,3,178,3],[177,5,178,5],[179,0,180,0],[179,1,180,1],[179,2,180,2],[179,3,180,3],[179,5,180,5],[181,0,182,0],[181,1,182,1],[181,2,182,2],[181,3,182,3],[181,5,182,5],[183,0,184,0],[183,1,184,1],[183,2,184,2],[183,3,184,3],[183,5,184,5],[185,0,186,0],[185,1,186,1],[185,2,186,2],[185,3,186,3],[185,5,186,5],[187,0,188,0],[187,1,188,1],[187,2,188,2],[187,3,188,3],[187,5,188,5],[189,1,190,1],[189,2,190,2],[189,3,190,3],[189,5,190,5],[191,0,192,0],[191,1,192,1],[191,2,192,2],[191,3,192,3],[191,5,192,5],[0,3,0,4],[1,3,1,4],[2,3,2,4],[197,0,198,0],[197,1,198,1],[197,2,198,2],[197,3,198,3],[197,5,198,5],[199,0,200,0],[199,1,200,1],[199,2,200,2],[199,3,200,3],[199,5,200,5],[193,0,194,0],[193,1,194,1],[193,2,194,2],[193,3,194,3],[193,5,194,5],[195,0,196,0],[195,1,196,1],[195,2,196,2],[195,3,196,3],[195,5,196,5],[189,0,190,0]]}
["Wettkampfbogen",null,"Ort / Datum :",{"$f":"'INFO Blatt'!B11","v":"Hehlen"},null,{"$f":"'INFO Blatt'!B13","v":"2018-03-03"}]
[null,null,"Mannschaft:",{"$f":"Formeln!A9","v":"Einbecker SV 1"},null,"Wertungsvorschriften"]
[null,null,"Liga:",{"$f":"'INFO Blatt'!B7","v":"Schülerliga Süd"},null,{"$f":"'INFO Blatt'!B5","v":"P-Stufen"}]
[]
["Name","Jg","Boden"]
[null,null,"D-Note","Abzug OK","E- Abzug","Note"]
["Tom Leonhard","07"]
[]
["Eugen Dahl","05"]
[]
["Dominic Kobben","05"]
[]
["Illes Törjek","06"]
[]
["Marlon Sassin","09"]
[]
["Nicolas Buchholz","05"]
[]
["Dins Kozlovskis","06"]
[]
["Fiete Linneweber","07"]
[]
["Joel Eitemeier","06"]
[]
[]
[]
[]
[]
[]
[]
[]
[]
[]
[]
[]
[]
[]
["Name","Jg","Pauschenpferd"]
[null,null,"D-Note","Abzug OK","E- Abzug","Note"]
[{"$f":"IF(A7>0,A7,\"\")","v":"Tom Leonhard"},{"$f":"IF(B7>0,B7,\"\")","v":"07"}]
[]
[{"$f":"IF(A9>0,A9,\"\")","v":"Eugen Dahl"},"05"]
[]
[{"$f":"IF(A11>0,A11,\"\")","v":"Dominic Kobben"},"05"]
[]
[{"$f":"IF(A13>0,A13,\"\")","v":"Illes Törjek"},"06"]
[]
[{"$f":"IF(A15>0,A15,\"\")","v":"Marlon Sassin"},"09"]
[]
[{"$f":"IF(A17>0,A17,\"\")","v":"Nicolas Buchholz"},"05"]
[]
[{"$f":"IF(A19>0,A19,\"\")","v":"Dins Kozlovskis"},"06"]
[]
[{"$f":"IF(A21>0,A21,\"\")","v":"Fiete Linneweber"},"07"]
[]
[{"$f":"IF(A23>0,A23,\"\")","v":"Joel Eitemeier"},"06"]
[]
[{"$f":"IF(A25>0,A25,\"\")","v":""},""]
[]
[{"$f":"IF(A27>0,A27,\"\")","v":""},""]
[]
[{"$f":"IF(A29>0,A29,\"\")","v":""},""]
[]
[{"$f":"IF(A31>0,A31,\"\")","v":""},""]
[]
[{"$f":"IF(A33>0,A33,\"\")","v":""},""]
[]
[{"$f":"IF(A35>0,A35,\"\")","v":""},""]
[]
[]
["Name","Jg","Ringe"]
[null,null,"D-Note","Abzug OK","E- Abzug","Note"]
[{"$f":"IF(A40>0,A40,\"\")","v":"Tom Leonhard"},{"$f":"IF(B40>0,B40,\"\")","v":"07"}]
[]
[{"$f":"IF(A42>0,A42,\"\")","v":"Eugen Dahl"},"05"]
[]
[{"$f":"IF(A44>0,A44,\"\")","v":"Dominic Kobben"},"05"]
[]
[{"$f":"IF(A46>0,A46,\"\")","v":"Illes Törjek"},"06"]
[]
[{"$f":"IF(A48>0,A48,\"\")","v":"Marlon Sassin"},"09"]
[]
[{"$f":"IF(A50>0,A50,\"\")","v":"Nicolas Buchholz"},"05"]
[]
[{"$f":"IF(A52>0,A52,\"\")","v":"Dins Kozlovskis"},"06"]
[]
[{"$f":"IF(A54>0,A54,\"\")","v":"Fiete Linneweber"},"07"]
[]
[{"$f":"IF(A56>0,A56,\"\")","v":"Joel Eitemeier"},"06"]
[]
[{"$f":"IF(A58>0,A58,\"\")","v":""},""]
[]
[{"$f":"IF(A60>0,A60,\"\")","v":""},""]
[]
[{"$f":"IF(A62>0,A62,\"\")","v":""},""]
[]
[{"$f":"IF(A64>0,A64,\"\")","v":""},""]
[]
[{"$f":"IF(A66>0,A66,\"\")","v":""},""]
[]
[{"$f":"IF(A68>0,A68,\"\")","v":""},""]
[]
[]
["Name","Jg","Sprung"]
[null,null,"D-Note","Abzug OK","E- Abzug","Note"]
[{"$f":"IF(A73>0,A73,\"\")","v":"Tom Leonhard"},{"$f":"IF(B73>0,B73,\"\")","v":"07"}]
[]
[{"$f":"IF(A75>0,A75,\"\")","v":"Eugen Dahl"},"05"]
[]
[{"$f":"IF(A77>0,A77,\"\")","v":"Dominic Kobben"},"05"]
[]
[{"$f":"IF(A79>0,A79,\"\")","v":"Illes Törjek"},"06"]
[]
[{"$f":"IF(A81>0,A81,\"\")","v":"Marlon Sassin"},"09"]
[]
[{"$f":"IF(A83>0,A83,\"\")","v":"Nicolas Buchholz"},"05"]
[]
[{"$f":"IF(A85>0,A85,\"\")","v":"Dins Kozlovskis"},"06"]
[]
[{"$f":"IF(A87>0,A87,\"\")","v":"Fiete Linneweber"},"07"]
[]
[{"$f":"IF(A89>0,A89,\"\")","v":"Joel Eitemeier"},"06"]
[]
[{"$f":"IF(A91>0,A91,\"\")","v":""},""]
[]
[{"$f":"IF(A93>0,A93,\"\")","v":""},""]
[]
[{"$f":"IF(A95>0,A95,\"\")","v":""},""]
[]
[{"$f":"IF(A97>0,A97,\"\")","v":""},""]
[]
[{"$f":"IF(A99>0,A99,\"\")","v":""},""]
[]
[{"$f":"IF(A101>0,A101,\"\")","v":""},""]
[]
[]
["Name","Jg","Barren"]
[null,null,"D-Note","Abzug OK","E- Abzug","Note"]
[{"$f":"IF(A106>0,A106,\"\")","v":"Tom Leonhard"},{"$f":"IF(B106>0,B106,\"\")","v":"07"}]
[]
[{"$f":"IF(A108>0,A108,\"\")","v":"Eugen Dahl"},"05"]
[]
[{"$f":"IF(A110>0,A110,\"\")","v":"Dominic Kobben"},"05"]
[]
[{"$f":"IF(A112>0,A112,\"\")","v":"Illes Törjek"},"06"]
[]
[{"$f":"IF(A114>0,A114,\"\")","v":"Marlon Sassin"},"09"]
[]
[{"$f":"IF(A116>0,A116,\"\")","v":"Nicolas Buchholz"},"05"]
[]
[{"$f":"IF(A118>0,A118,\"\")","v":"Dins Kozlovskis"},"06"]
[]
[{"$f":"IF(A120>0,A120,\"\")","v":"Fiete Linneweber"},"07"]
[]
[{"$f":"IF(A122>0,A122,\"\")","v":"Joel Eitemeier"},"06"]
[]
[{"$f":"IF(A124>0,A124,\"\")","v":""},""]
[]
[{"$f":"IF(A126>0,A126,\"\")","v":""},""]
[]
[{"$f":"IF(A128>0,A128,\"\")","v":""},""]
[]
[{"$f":"IF(A130>0,A130,\"\")","v":""},""]
[]
[{"$f":"IF(A132>0,A132,\"\")","v":""},""]
[]
[{"$f":"IF(A134>0,A134,\"\")","v":""},""]
[]
[]
["Name","Jg","Reck"]
[null,null,"D-Note","Abzug OK","E- Abzug","Note"]
[{"$f":"IF(A139>0,A139,\"\")","v":"Tom Leonhard"},{"$f":"IF(B139>0,B139,\"\")","v":"07"}]
[]
[{"$f":"IF(A141>0,A141,\"\")","v":"Eugen Dahl"},"05"]
[]
[{"$f":"IF(A143>0,A143,\"\")","v":"Dominic Kobben"},"05"]
[]
[{"$f":"IF(A145>0,A145,\"\")","v":"Illes Törjek"},"06"]
[]
[{"$f":"IF(A147>0,A147,\"\")","v":"Marlon Sassin"},"09"]
[]
[{"$f":"IF(A149>0,A149,\"\")","v":"Nicolas Buchholz"},"05"]
[]
[{"$f":"IF(A151>0,A151,\"\")","v":"Dins Kozlovskis"},"06"]
[]
[{"$f":"IF(A153>0,A153,\"\")","v":"Fiete Linneweber"},"07"]
[]
[{"$f":"IF(A155>0,A155,\"\")","v":"Joel Eitemeier"},"06"]
[]
[{"$f":"IF(A157>0,A157,\"\")","v":""},""]
[]
[{"$f":"IF(A159>0,A159,\"\")","v":""},""]
[]
[{"$f":"IF(A161>0,A161,\"\")","v":""},""]
[]
[{"$f":"IF(A163>0,A163,\"\")","v":""},""]
[]
[{"$f":"IF(A165>0,A165,\"\")","v":""},""]
[]
[{"$f":"IF(A167>0,A167,\"\")","v":""},""]

{"sheet":"Wertungszettel M6","index":19,"n_rows":200,"n_cols":6,"rows_kept":200,"cut":false,"hidden":false,"merged":[[4,2,4,5],[8,0,9,0],[8,1,9,1],[8,2,9,2],[8,3,9,3],[8,5,9,5],[6,0,7,0],[6,1,7,1],[6,2,7,2],[6,3,7,3],[6,5,7,5],[12,0,13,0],[12,1,13,1],[12,2,13,2],[12,3,13,3],[12,5,13,5],[10,0,11,0],[10,1,11,1],[10,2,11,2],[10,3,11,3],[10,5,11,5],[16,0,17,0],[16,1,17,1],[16,2,17,2],[16,3,17,3],[16,5,17,5],[14,0,15,0],[14,1,15,1],[14,2,15,2],[14,3,15,3],[14,5,15,5],[20,0,21,0],[20,1,21,1],[20,2,21,2],[20,3,21,3],[20,5,21,5],[18,0,19,0],[18,1,19,1],[18,2,19,2],[18,3,19,3],[18,5,19,5],[24,0,25,0],[24,1,25,1],[24,2,25,2],[24,3,25,3],[24,5,25,5],[22,0,23,0],[22,1,23,1],[22,2,23,2],[22,3,23,3],[22,5,23,5],[28,0,29,0],[28,1,29,1],[28,2,29,2],[28,3,29,3],[28,5,29,5],[26,0,27,0],[26,1,27,1],[26,2,27,2],[26,3,27,3],[26,5,27,5],[32,0,33,0],[32,1,33,1],[32,2,33,2],[32,3,33,3],[32,5,33,5],[30,0,31,0],[30,1,31,1],[30,2,31,2],[30,3,31,3],[30,5,31,5],[39,0,40,0],[39,1,40,1],[39,2,40,2],[39,3,40,3],[39,5,40,5],[37,2,37,5],[34,0,35,0],[34,1,35,1],[34,2,35,2],[34,3,35,3],[34,5,35,5],[43,0,44,0],[43,1,44,1],[43,2,44,2],[43,3,44,3],[43,5,44,5],[41,0,42,0],[41,1,42,1],[41,2,42,2],[41,3,42,3],[41,5,42,5],[47,0,48,0],[47,1,48,1],[47,2,48,2],[47,3,48,3],[47,5,48,5],[45,0,46,0],[45,1,46,1],[45,2,46,2],[45,3,46,3],[45,5,46,5],[51,0,52,0],[51,1,52,1],[51,2,52,2],[51,3,52,3],[51,5,52,5],[49,0,50,0],[49,1,50,1],[49,2,50,2],[49,3,50,3],[49,5,50,5],[55,0,56,0],[55,1,56,1],[55,2,56,2],[55,3,56,3],[55,5,56,5],[53,0,54,0],[53,1,54,1],[53,2,54,2],[53,3,54,3],[53,5,54,5],[59,0,60,0],[59,1,60,1],[59,2,60,2],[59,3,60,3],[59,5,60,5],[57,0,58,0],[57,1,58,1],[57,2,58,2],[57,3,58,3],[57,5,58,5],[63,0,64,0],[63,1,64,1],[63,2,64,2],[63,3,64,3],[63,5,64,5],[61,0,62,0],[61,1,62,1],[61,2,62,2],[61,3,62,3],[61,5,62,5],[67,0,68,0],[67,1,68,1],[67,2,68,2],[67,3,68,3],[67,5,68,5],[65,0,66,0],[65,1,66,1],[65,2,66,2],[65,3,66,3],[65,5,66,5],[70,2,70,5],[72,0,73,0],[72,1,73,1],[72,2,73,2],[72,3,73,3],[72,5,73,5],[74,0,75,0],[74,1,75,1],[74,2,75,2],[74,3,75,3],[74,5,75,5],[76,0,77,0],[76,1,77,1],[76,2,77,2],[76,3,77,3],[76,5,77,5],[78,0,79,0],[78,1,79,1],[78,2,79,2],[78,3,79,3],[78,5,79,5],[80,0,81,0],[80,1,81,1],[80,2,81,2],[80,3,81,3],[80,5,81,5],[82,0,83,0],[82,1,83,1],[82,2,83,2],[82,3,83,3],[82,5,83,5],[84,0,85,0],[84,1,85,1],[84,2,85,2],[84,3,85,3],[84,5,85,5],[86,0,87,0],[86,1,87,1],[86,2,87,2],[86,3,87,3],[86,5,87,5],[88,0,89,0],[88,1,89,1],[88,2,89,2],[88,3,89,3],[88,5,89,5],[90,0,91,0],[90,1,91,1],[90,2,91,2],[90,3,91,3],[90,5,91,5],[92,0,93,0],[92,1,93,1],[92,2,93,2],[92,3,93,3],[92,5,93,5],[94,0,95,0],[94,1,95,1],[94,2,95,2],[94,3,95,3],[94,5,95,5],[96,0,97,0],[96,1,97,1],[96,2,97,2],[96,3,97,3],[96,5,97,5],[98,0,99,0],[98,1,99,1],[98,2,99,2],[98,3,99,3],[98,5,99,5],[100,0,101,0],[100,1,101,1],[100,2,101,2],[100,3,101,3],[100,5,101,5],[103,2,103,5],[105,0,106,0],[105,1,106,1],[105,2,106,2],[105,3,106,3],[105,5,106,5],[107,0,108,0],[107,1,108,1],[107,2,108,2],[107,3,108,3],[107,5,108,5],[109,0,110,0],[109,1,110,1],[109,2,110,2],[109,3,110,3],[109,5,110,5],[111,0,112,0],[111,1,112,1],[111,2,112,2],[111,3,112,3],[111,5,112,5],[113,0,114,0],[113,1,114,1],[113,2,114,2],[113,3,114,3],[113,5,114,5],[115,0,116,0],[115,1,116,1],[115,2,116,2],[115,3,116,3],[115,5,116,5],[117,0,118,0],[117,1,118,1],[117,2,118,2],[117,3,118,3],[117,5,118,5],[119,0,120,0],[119,1,120,1],[119,2,120,2],[119,3,120,3],[119,5,120,5],[121,0,122,0],[121,1,122,1],[121,2,122,2],[121,3,122,3],[121,5,122,5],[123,0,124,0],[123,1,124,1],[123,2,124,2],[123,3,124,3],[123,5,124,5],[125,0,126,0],[125,1,126,1],[125,2,126,2],[125,3,126,3],[125,5,126,5],[127,0,128,0],[127,1,128,1],[127,2,128,2],[127,3,128,3],[127,5,128,5],[129,0,130,0],[129,1,130,1],[129,2,130,2],[129,3,130,3],[129,5,130,5],[131,0,132,0],[131,1,132,1],[131,2,132,2],[131,3,132,3],[131,5,132,5],[133,0,134,0],[133,1,134,1],[133,2,134,2],[133,3,134,3],[133,5,134,5],[136,2,136,5],[138,0,139,0],[138,1,139,1],[138,2,139,2],[138,3,139,3],[138,5,139,5],[140,0,141,0],[140,1,141,1],[140,2,141,2],[140,3,141,3],[140,5,141,5],[142,0,143,0],[142,1,143,1],[142,2,143,2],[142,3,143,3],[142,5,143,5],[144,0,145,0],[144,1,145,1],[144,2,145,2],[144,3,145,3],[144,5,145,5],[146,0,147,0],[146,1,147,1],[146,2,147,2],[146,3,147,3],[146,5,147,5],[148,0,149,0],[148,1,149,1],[148,2,149,2],[148,3,149,3],[148,5,149,5],[150,0,151,0],[150,1,151,1],[150,2,151,2],[150,3,151,3],[150,5,151,5],[152,0,153,0],[152,1,153,1],[152,2,153,2],[152,3,153,3],[152,5,153,5],[154,0,155,0],[154,1,155,1],[154,2,155,2],[154,3,155,3],[154,5,155,5],[156,0,157,0],[156,1,157,1],[156,2,157,2],[156,3,157,3],[156,5,157,5],[158,0,159,0],[158,1,159,1],[158,2,159,2],[158,3,159,3],[158,5,159,5],[160,0,161,0],[160,1,161,1],[160,2,161,2],[160,3,161,3],[160,5,161,5],[162,0,163,0],[162,1,163,1],[162,2,163,2],[162,3,163,3],[162,5,163,5],[164,0,165,0],[164,1,165,1],[164,2,165,2],[164,3,165,3],[164,5,165,5],[166,0,167,0],[166,1,167,1],[166,2,167,2],[166,3,167,3],[166,5,167,5],[169,2,169,5],[171,0,172,0],[171,1,172,1],[171,2,172,2],[171,3,172,3],[171,5,172,5],[173,0,174,0],[173,1,174,1],[173,2,174,2],[173,3,174,3],[173,5,174,5],[175,0,176,0],[175,1,176,1],[175,2,176,2],[175,3,176,3],[175,5,176,5],[177,0,178,0],[177,1,178,1],[177,2,178,2],[177,3,178,3],[177,5,178,5],[179,0,180,0],[179,1,180,1],[179,2,180,2],[179,3,180,3],[179,5,180,5],[181,0,182,0],[181,1,182,1],[181,2,182,2],[181,3,182,3],[181,5,182,5],[183,0,184,0],[183,1,184,1],[183,2,184,2],[183,3,184,3],[183,5,184,5],[185,0,186,0],[185,1,186,1],[185,2,186,2],[185,3,186,3],[185,5,186,5],[187,0,188,0],[187,1,188,1],[187,2,188,2],[187,3,188,3],[187,5,188,5],[189,1,190,1],[189,2,190,2],[189,3,190,3],[189,5,190,5],[191,0,192,0],[191,1,192,1],[191,2,192,2],[191,3,192,3],[191,5,192,5],[0,3,0,4],[1,3,1,4],[2,3,2,4],[197,0,198,0],[197,1,198,1],[197,2,198,2],[197,3,198,3],[197,5,198,5],[199,0,200,0],[199,1,200,1],[199,2,200,2],[199,3,200,3],[199,5,200,5],[193,0,194,0],[193,1,194,1],[193,2,194,2],[193,3,194,3],[193,5,194,5],[195,0,196,0],[195,1,196,1],[195,2,196,2],[195,3,196,3],[195,5,196,5],[189,0,190,0]]}
["Wettkampfbogen",null,"Ort / Datum :",{"$f":"'INFO Blatt'!B11","v":"Hehlen"},null,{"$f":"'INFO Blatt'!B13","v":"2018-03-03"}]
[null,null,"Mannschaft:",{"$f":"Formeln!A10","v":"Einbecker SV 2"},null,"Wertungsvorschriften"]
[null,null,"Liga:",{"$f":"'INFO Blatt'!B7","v":"Schülerliga Süd"},null,{"$f":"'INFO Blatt'!B5","v":"P-Stufen"}]
[]
["Name","Jg","Boden"]
[null,null,"D-Note","Abzug OK","E- Abzug","Note"]
["Wiliam Lampe","07"]
[]
["Dominik Kumarasamy","07"]
[]
["Leon Freye","07"]
[]
["Johann Mickat","06"]
[]
["Lu Rosebrock","06"]
[]
[]
[]
[]
[]
[]
[]
[]
[]
[]
[]
[]
[]
[]
[]
[]
[]
[]
[]
[]
[]
[]
["Name","Jg","Pauschenpferd"]
[null,null,"D-Note","Abzug OK","E- Abzug","Note"]
[{"$f":"IF(A7>0,A7,\"\")","v":"Wiliam Lampe"},{"$f":"IF(B7>0,B7,\"\")","v":"07"}]
[]
[{"$f":"IF(A9>0,A9,\"\")","v":"Dominik Kumarasamy"},"07"]
[]
[{"$f":"IF(A11>0,A11,\"\")","v":"Leon Freye"},"07"]
[]
[{"$f":"IF(A13>0,A13,\"\")","v":"Johann Mickat"},"06"]
[]
[{"$f":"IF(A15>0,A15,\"\")","v":"Lu Rosebrock"},"06"]
[]
[{"$f":"IF(A17>0,A17,\"\")","v":""},""]
[]
[{"$f":"IF(A19>0,A19,\"\")","v":""},""]
[]
[{"$f":"IF(A21>0,A21,\"\")","v":""},""]
[]
[{"$f":"IF(A23>0,A23,\"\")","v":""},""]
[]
[{"$f":"IF(A25>0,A25,\"\")","v":""},""]
[]
[{"$f":"IF(A27>0,A27,\"\")","v":""},""]
[]
[{"$f":"IF(A29>0,A29,\"\")","v":""},""]
[]
[{"$f":"IF(A31>0,A31,\"\")","v":""},""]
[]
[{"$f":"IF(A33>0,A33,\"\")","v":""},""]
[]
[{"$f":"IF(A35>0,A35,\"\")","v":""},""]
[]
[]
["Name","Jg","Ringe"]
[null,null,"D-Note","Abzug OK","E- Abzug","Note"]
[{"$f":"IF(A40>0,A40,\"\")","v":"Wiliam Lampe"},{"$f":"IF(B40>0,B40,\"\")","v":"07"}]
[]
[{"$f":"IF(A42>0,A42,\"\")","v":"Dominik Kumarasamy"},"07"]
[]
[{"$f":"IF(A44>0,A44,\"\")","v":"Leon Freye"},"07"]
[]
[{"$f":"IF(A46>0,A46,\"\")","v":"Johann Mickat"},"06"]
[]
[{"$f":"IF(A48>0,A48,\"\")","v":"Lu Rosebrock"},"06"]
[]
[{"$f":"IF(A50>0,A50,\"\")","v":""},""]
[]
[{"$f":"IF(A52>0,A52,\"\")","v":""},""]
[]
[{"$f":"IF(A54>0,A54,\"\")","v":""},""]
[]
[{"$f":"IF(A56>0,A56,\"\")","v":""},""]
[]
[{"$f":"IF(A58>0,A58,\"\")","v":""},""]
[]
[{"$f":"IF(A60>0,A60,\"\")","v":""},""]
[]
[{"$f":"IF(A62>0,A62,\"\")","v":""},""]
[]
[{"$f":"IF(A64>0,A64,\"\")","v":""},""]
[]
[{"$f":"IF(A66>0,A66,\"\")","v":""},""]
[]
[{"$f":"IF(A68>0,A68,\"\")","v":""},""]
[]
[]
["Name","Jg","Sprung"]
[null,null,"D-Note","Abzug OK","E- Abzug","Note"]
[{"$f":"IF(A73>0,A73,\"\")","v":"Wiliam Lampe"},{"$f":"IF(B73>0,B73,\"\")","v":"07"}]
[]
[{"$f":"IF(A75>0,A75,\"\")","v":"Dominik Kumarasamy"},"07"]
[]
[{"$f":"IF(A77>0,A77,\"\")","v":"Leon Freye"},"07"]
[]
[{"$f":"IF(A79>0,A79,\"\")","v":"Johann Mickat"},"06"]
[]
[{"$f":"IF(A81>0,A81,\"\")","v":"Lu Rosebrock"},"06"]
[]
[{"$f":"IF(A83>0,A83,\"\")","v":""},""]
[]
[{"$f":"IF(A85>0,A85,\"\")","v":""},""]
[]
[{"$f":"IF(A87>0,A87,\"\")","v":""},""]
[]
[{"$f":"IF(A89>0,A89,\"\")","v":""},""]
[]
[{"$f":"IF(A91>0,A91,\"\")","v":""},""]
[]
[{"$f":"IF(A93>0,A93,\"\")","v":""},""]
[]
[{"$f":"IF(A95>0,A95,\"\")","v":""},""]
[]
[{"$f":"IF(A97>0,A97,\"\")","v":""},""]
[]
[{"$f":"IF(A99>0,A99,\"\")","v":""},""]
[]
[{"$f":"IF(A101>0,A101,\"\")","v":""},""]
[]
[]
["Name","Jg","Barren"]
[null,null,"D-Note","Abzug OK","E- Abzug","Note"]
[{"$f":"IF(A106>0,A106,\"\")","v":"Wiliam Lampe"},{"$f":"IF(B106>0,B106,\"\")","v":"07"}]
[]
[{"$f":"IF(A108>0,A108,\"\")","v":"Dominik Kumarasamy"},"07"]
[]
[{"$f":"IF(A110>0,A110,\"\")","v":"Leon Freye"},"07"]
[]
[{"$f":"IF(A112>0,A112,\"\")","v":"Johann Mickat"},"06"]
[]
[{"$f":"IF(A114>0,A114,\"\")","v":"Lu Rosebrock"},"06"]
[]
[{"$f":"IF(A116>0,A116,\"\")","v":""},""]
[]
[{"$f":"IF(A118>0,A118,\"\")","v":""},""]
[]
[{"$f":"IF(A120>0,A120,\"\")","v":""},""]
[]
[{"$f":"IF(A122>0,A122,\"\")","v":""},""]
[]
[{"$f":"IF(A124>0,A124,\"\")","v":""},""]
[]
[{"$f":"IF(A126>0,A126,\"\")","v":""},""]
[]
[{"$f":"IF(A128>0,A128,\"\")","v":""},""]
[]
[{"$f":"IF(A130>0,A130,\"\")","v":""},""]
[]
[{"$f":"IF(A132>0,A132,\"\")","v":""},""]
[]
[{"$f":"IF(A134>0,A134,\"\")","v":""},""]
[]
[]
["Name","Jg","Reck"]
[null,null,"D-Note","Abzug OK","E- Abzug","Note"]
[{"$f":"IF(A139>0,A139,\"\")","v":"Wiliam Lampe"},{"$f":"IF(B139>0,B139,\"\")","v":"07"}]
[]
[{"$f":"IF(A141>0,A141,\"\")","v":"Dominik Kumarasamy"},"07"]
[]
[{"$f":"IF(A143>0,A143,\"\")","v":"Leon Freye"},"07"]
[]
[{"$f":"IF(A145>0,A145,\"\")","v":"Johann Mickat"},"06"]
[]
[{"$f":"IF(A147>0,A147,\"\")","v":"Lu Rosebrock"},"06"]
[]
[{"$f":"IF(A149>0,A149,\"\")","v":""},""]
[]
[{"$f":"IF(A151>0,A151,\"\")","v":""},""]
[]
[{"$f":"IF(A153>0,A153,\"\")","v":""},""]
[]
[{"$f":"IF(A155>0,A155,\"\")","v":""},""]
[]
[{"$f":"IF(A157>0,A157,\"\")","v":""},""]
[]
[{"$f":"IF(A159>0,A159,\"\")","v":""},""]
[]
[{"$f":"IF(A161>0,A161,\"\")","v":""},""]
[]
[{"$f":"IF(A163>0,A163,\"\")","v":""},""]
[]
[{"$f":"IF(A165>0,A165,\"\")","v":""},""]
[]
[{"$f":"IF(A167>0,A167,\"\")","v":""},""]

{"sheet":"Wertungszettel M7","index":20,"n_rows":200,"n_cols":6,"rows_kept":200,"cut":false,"hidden":false,"merged":[[197,0,198,0],[197,1,198,1],[197,2,198,2],[197,3,198,3],[197,5,198,5],[199,0,200,0],[199,1,200,1],[199,2,200,2],[199,3,200,3],[199,5,200,5],[193,0,194,0],[193,1,194,1],[193,2,194,2],[193,3,194,3],[193,5,194,5],[195,0,196,0],[195,1,196,1],[195,2,196,2],[195,3,196,3],[195,5,196,5],[189,0,190,0],[189,1,190,1],[189,2,190,2],[189,3,190,3],[189,5,190,5],[191,0,192,0],[191,1,192,1],[191,2,192,2],[191,3,192,3],[191,5,192,5],[185,0,186,0],[185,1,186,1],[185,2,186,2],[185,3,186,3],[185,5,186,5],[187,0,188,0],[187,1,188,1],[187,2,188,2],[187,3,188,3],[187,5,188,5],[181,0,182,0],[181,1,182,1],[181,2,182,2],[181,3,182,3],[181,5,182,5],[183,0,184,0],[183,1,184,1],[183,2,184,2],[183,3,184,3],[183,5,184,5],[177,0,178,0],[177,1,178,1],[177,2,178,2],[177,3,178,3],[177,5,178,5],[179,0,180,0],[179,1,180,1],[179,2,180,2],[179,3,180,3],[179,5,180,5],[173,0,174,0],[173,1,174,1],[173,2,174,2],[173,3,174,3],[173,5,174,5],[175,0,176,0],[175,1,176,1],[175,2,176,2],[175,3,176,3],[175,5,176,5],[169,2,169,5],[171,0,172,0],[171,1,172,1],[171,2,172,2],[171,3,172,3],[171,5,172,5],[164,0,165,0],[164,1,165,1],[164,2,165,2],[164,3,165,3],[164,5,165,5],[166,0,167,0],[166,1,167,1],[166,2,167,2],[166,3,167,3],[166,5,167,5],[160,0,161,0],[160,1,161,1],[160,2,161,2],[160,3,161,3],[160,5,161,5],[162,0,163,0],[162,1,163,1],[162,2,163,2],[162,3,163,3],[162,5,163,5],[156,0,157,0],[156,1,157,1],[156,2,157,2],[156,3,157,3],[156,5,157,5],[158,0,159,0],[158,1,159,1],[158,2,159,2],[158,3,159,3],[158,5,159,5],[152,0,153,0],[152,1,153,1],[152,2,153,2],[152,3,153,3],[152,5,153,5],[154,0,155,0],[154,1,155,1],[154,2,155,2],[154,3,155,3],[154,5,155,5],[148,0,149,0],[148,1,149,1],[148,2,149,2],[148,3,149,3],[148,5,149,5],[150,0,151,0],[150,1,151,1],[150,2,151,2],[150,3,151,3],[150,5,151,5],[144,0,145,0],[144,1,145,1],[144,2,145,2],[144,3,145,3],[144,5,145,5],[146,0,147,0],[146,1,147,1],[146,2,147,2],[146,3,147,3],[146,5,147,5],[140,0,141,0],[140,1,141,1],[140,2,141,2],[140,3,141,3],[140,5,141,5],[142,0,143,0],[142,1,143,1],[142,2,143,2],[142,3,143,3],[142,5,143,5],[136,2,136,5],[138,0,139,0],[138,1,139,1],[138,2,139,2],[138,3,139,3],[138,5,139,5],[131,0,132,0],[131,1,132,1],[131,2,132,2],[131,3,132,3],[131,5,132,5],[133,0,134,0],[133,1,134,1],[133,2,134,2],[133,3,134,3],[133,5,134,5],[127,0,128,0],[127,1,128,1],[127,2,128,2],[127,3,128,3],[127,5,128,5],[129,0,130,0],[129,1,130,1],[129,2,130,2],[129,3,130,3],[129,5,130,5],[123,0,124,0],[123,1,124,1],[123,2,124,2],[123,3,124,3],[123,5,124,5],[125,0,126,0],[125,1,126,1],[125,2,126,2],[125,3,126,3],[125,5,126,5],[119,0,120,0],[119,1,120,1],[119,2,120,2],[119,3,120,3],[119,5,120,5],[121,0,122,0],[121,1,122,1],[121,2,122,2],[121,3,122,3],[121,5,122,5],[115,0,116,0],[115,1,116,1],[115,2,116,2],[115,3,116,3],[115,5,116,5],[117,0,118,0],[117,1,118,1],[117,2,118,2],[117,3,118,3],[117,5,118,5],[111,0,112,0],[111,1,112,1],[111,2,112,2],[111,3,112,3],[111,5,112,5],[113,0,114,0],[113,1,114,1],[113,2,114,2],[113,3,114,3],[113,5,114,5],[107,0,108,0],[107,1,108,1],[107,2,108,2],[107,3,108,3],[107,5,108,5],[109,0,110,0],[109,1,110,1],[109,2,110,2],[109,3,110,3],[109,5,110,5],[103,2,103,5],[105,0,106,0],[105,1,106,1],[105,2,106,2],[105,3,106,3],[105,5,106,5],[98,0,99,0],[98,1,99,1],[98,2,99,2],[98,3,99,3],[98,5,99,5],[100,0,101,0],[100,1,101,1],[100,2,101,2],[100,3,101,3],[100,5,101,5],[94,0,95,0],[94,1,95,1],[94,2,95,2],[94,3,95,3],[94,5,95,5],[96,0,97,0],[96,1,97,1],[96,2,97,2],[96,3,97,3],[96,5,97,5],[90,0,91,0],[90,1,91,1],[90,2,91,2],[90,3,91,3],[90,5,91,5],[92,0,93,0],[92,1,93,1],[92,2,93,2],[92,3,93,3],[92,5,93,5],[86,0,87,0],[86,1,87,1],[86,2,87,2],[86,3,87,3],[86,5,87,5],[88,0,89,0],[88,1,89,1],[88,2,89,2],[88,3,89,3],[88,5,89,5],[82,0,83,0],[82,1,83,1],[82,2,83,2],[82,3,83,3],[82,5,83,5],[84,0,85,0],[84,1,85,1],[84,2,85,2],[84,3,85,3],[84,5,85,5],[78,0,79,0],[78,1,79,1],[78,2,79,2],[78,3,79,3],[78,5,79,5],[80,0,81,0],[80,1,81,1],[80,2,81,2],[80,3,81,3],[80,5,81,5],[74,0,75,0],[74,1,75,1],[74,2,75,2],[74,3,75,3],[74,5,75,5],[76,0,77,0],[76,1,77,1],[76,2,77,2],[76,3,77,3],[76,5,77,5],[70,2,70,5],[72,0,73,0],[72,1,73,1],[72,2,73,2],[72,3,73,3],[72,5,73,5],[65,0,66,0],[65,1,66,1],[65,2,66,2],[65,3,66,3],[65,5,66,5],[67,0,68,0],[67,1,68,1],[67,2,68,2],[67,3,68,3],[67,5,68,5],[61,0,62,0],[61,1,62,1],[61,2,62,2],[61,3,62,3],[61,5,62,5],[63,0,64,0],[63,1,64,1],[63,2,64,2],[63,3,64,3],[63,5,64,5],[57,0,58,0],[57,1,58,1],[57,2,58,2],[57,3,58,3],[57,5,58,5],[59,0,60,0],[59,1,60,1],[59,2,60,2],[59,3,60,3],[59,5,60,5],[53,0,54,0],[53,1,54,1],[53,2,54,2],[53,3,54,3],[53,5,54,5],[55,0,56,0],[55,1,56,1],[55,2,56,2],[55,3,56,3],[55,5,56,5],[49,0,50,0],[49,1,50,1],[49,2,50,2],[49,3,50,3],[49,5,50,5],[51,0,52,0],[51,1,52,1],[51,2,52,2],[51,3,52,3],[51,5,52,5],[45,0,46,0],[45,1,46,1],[45,2,46,2],[45,3,46,3],[45,5,46,5],[47,0,48,0],[47,1,48,1],[47,2,48,2],[47,3,48,3],[47,5,48,5],[41,0,42,0],[41,1,42,1],[41,2,42,2],[41,3,42,3],[41,5,42,5],[43,0,44,0],[43,1,44,1],[43,2,44,2],[43,3,44,3],[43,5,44,5],[37,2,37,5],[39,0,40,0],[39,1,40,1],[39,2,40,2],[39,3,40,3],[39,5,40,5],[32,0,33,0],[32,1,33,1],[32,2,33,2],[32,3,33,3],[32,5,33,5],[34,0,35,0],[34,1,35,1],[34,2,35,2],[34,3,35,3],[34,5,35,5],[28,0,29,0],[28,1,29,1],[28,2,29,2],[28,3,29,3],[28,5,29,5],[30,0,31,0],[30,1,31,1],[30,2,31,2],[30,3,31,3],[30,5,31,5],[24,0,25,0],[24,1,25,1],[24,2,25,2],[24,3,25,3],[24,5,25,5],[26,0,27,0],[26,1,27,1],[26,2,27,2],[26,3,27,3],[26,5,27,5],[20,0,21,0],[20,1,21,1],[20,2,21,2],[20,3,21,3],[20,5,21,5],[22,0,23,0],[22,1,23,1],[22,2,23,2],[22,3,23,3],[22,5,23,5],[16,0,17,0],[16,1,17,1],[16,2,17,2],[16,3,17,3],[16,5,17,5],[18,0,19,0],[18,1,19,1],[18,2,19,2],[18,3,19,3],[18,5,19,5],[12,0,13,0],[12,1,13,1],[12,2,13,2],[12,3,13,3],[12,5,13,5],[14,0,15,0],[14,1,15,1],[14,2,15,2],[14,3,15,3],[14,5,15,5],[8,0,9,0],[8,1,9,1],[8,2,9,2],[8,3,9,3],[8,5,9,5],[10,0,11,0],[10,1,11,1],[10,2,11,2],[10,3,11,3],[10,5,11,5],[0,3,0,4],[1,3,1,4],[2,3,2,4],[4,2,4,5],[6,0,7,0],[6,1,7,1],[6,2,7,2],[6,3,7,3],[6,5,7,5]]}
["Wettkampfbogen",null,"Ort / Datum :",{"$f":"'INFO Blatt'!B11","v":"Hehlen"},null,{"$f":"'INFO Blatt'!B13","v":"2018-03-03"}]
[null,null,"Mannschaft:",{"$f":"Formeln!A11","v":"TG Hehlen Dielmissen"},null,"Wertungsvorschriften"]
[null,null,"Liga:",{"$f":"'INFO Blatt'!B7","v":"Schülerliga Süd"},null,{"$f":"'INFO Blatt'!B5","v":"P-Stufen"}]
[]
["Name","Jg","Boden"]
[null,null,"D-Note","Abzug OK","E- Abzug","Note"]
["Viktor Brauer","07"]
[]
["Norwin Eilers","07"]
[]
["Thore Gruppe","07"]
[]
["Jakob Kammel","07"]
[]
["Luca Puls","07"]
[]
["Yvo Vehling","07"]
[]
["Timm Zuchold","07"]
[]
[]
[]
[]
[]
[]
[]
[]
[]
[]
[]
[]
[]
[]
[]
[]
[]
[]
["Name","Jg","Pauschenpferd"]
[null,null,"D-Note","Abzug OK","E- Abzug","Note"]
[{"$f":"IF(A7>0,A7,\"\")","v":"Viktor Brauer"},{"$f":"IF(B7>0,B7,\"\")","v":"07"}]
[]
[{"$f":"IF(A9>0,A9,\"\")","v":"Norwin Eilers"},"07"]
[]
[{"$f":"IF(A11>0,A11,\"\")","v":"Thore Gruppe"},"07"]
[]
[{"$f":"IF(A13>0,A13,\"\")","v":"Jakob Kammel"},"07"]
[]
[{"$f":"IF(A15>0,A15,\"\")","v":"Luca Puls"},"07"]
[]
[{"$f":"IF(A17>0,A17,\"\")","v":"Yvo Vehling"},"07"]
[]
[{"$f":"IF(A19>0,A19,\"\")","v":"Timm Zuchold"},"07"]
[]
[{"$f":"IF(A21>0,A21,\"\")","v":""},""]
[]
[{"$f":"IF(A23>0,A23,\"\")","v":""},""]
[]
[{"$f":"IF(A25>0,A25,\"\")","v":""},""]
[]
[{"$f":"IF(A27>0,A27,\"\")","v":""},""]
[]
[{"$f":"IF(A29>0,A29,\"\")","v":""},""]
[]
[{"$f":"IF(A31>0,A31,\"\")","v":""},""]
[]
[{"$f":"IF(A33>0,A33,\"\")","v":""},""]
[]
[{"$f":"IF(A35>0,A35,\"\")","v":""},""]
[]
[]
["Name","Jg","Ringe"]
[null,null,"D-Note","Abzug OK","E- Abzug","Note"]
[{"$f":"IF(A40>0,A40,\"\")","v":"Viktor Brauer"},{"$f":"IF(B40>0,B40,\"\")","v":"07"}]
[]
[{"$f":"IF(A42>0,A42,\"\")","v":"Norwin Eilers"},"07"]
[]
[{"$f":"IF(A44>0,A44,\"\")","v":"Thore Gruppe"},"07"]
[]
[{"$f":"IF(A46>0,A46,\"\")","v":"Jakob Kammel"},"07"]
[]
[{"$f":"IF(A48>0,A48,\"\")","v":"Luca Puls"},"07"]
[]
[{"$f":"IF(A50>0,A50,\"\")","v":"Yvo Vehling"},"07"]
[]
[{"$f":"IF(A52>0,A52,\"\")","v":"Timm Zuchold"},"07"]
[]
[{"$f":"IF(A54>0,A54,\"\")","v":""},""]
[]
[{"$f":"IF(A56>0,A56,\"\")","v":""},""]
[]
[{"$f":"IF(A58>0,A58,\"\")","v":""},""]
[]
[{"$f":"IF(A60>0,A60,\"\")","v":""},""]
[]
[{"$f":"IF(A62>0,A62,\"\")","v":""},""]
[]
[{"$f":"IF(A64>0,A64,\"\")","v":""},""]
[]
[{"$f":"IF(A66>0,A66,\"\")","v":""},""]
[]
[{"$f":"IF(A68>0,A68,\"\")","v":""},""]
[]
[]
["Name","Jg","Sprung"]
[null,null,"D-Note","Abzug OK","E- Abzug","Note"]
[{"$f":"IF(A73>0,A73,\"\")","v":"Viktor Brauer"},{"$f":"IF(B73>0,B73,\"\")","v":"07"}]
[]
[{"$f":"IF(A75>0,A75,\"\")","v":"Norwin Eilers"},"07"]
[]
[{"$f":"IF(A77>0,A77,\"\")","v":"Thore Gruppe"},"07"]
[]
[{"$f":"IF(A79>0,A79,\"\")","v":"Jakob Kammel"},"07"]
[]
[{"$f":"IF(A81>0,A81,\"\")","v":"Luca Puls"},"07"]
[]
[{"$f":"IF(A83>0,A83,\"\")","v":"Yvo Vehling"},"07"]
[]
[{"$f":"IF(A85>0,A85,\"\")","v":"Timm Zuchold"},"07"]
[]
[{"$f":"IF(A87>0,A87,\"\")","v":""},""]
[]
[{"$f":"IF(A89>0,A89,\"\")","v":""},""]
[]
[{"$f":"IF(A91>0,A91,\"\")","v":""},""]
[]
[{"$f":"IF(A93>0,A93,\"\")","v":""},""]
[]
[{"$f":"IF(A95>0,A95,\"\")","v":""},""]
[]
[{"$f":"IF(A97>0,A97,\"\")","v":""},""]
[]
[{"$f":"IF(A99>0,A99,\"\")","v":""},""]
[]
[{"$f":"IF(A101>0,A101,\"\")","v":""},""]
[]
[]
["Name","Jg","Barren"]
[null,null,"D-Note","Abzug OK","E- Abzug","Note"]
[{"$f":"IF(A106>0,A106,\"\")","v":"Viktor Brauer"},{"$f":"IF(B106>0,B106,\"\")","v":"07"}]
[]
[{"$f":"IF(A108>0,A108,\"\")","v":"Norwin Eilers"},"07"]
[]
[{"$f":"IF(A110>0,A110,\"\")","v":"Thore Gruppe"},"07"]
[]
[{"$f":"IF(A112>0,A112,\"\")","v":"Jakob Kammel"},"07"]
[]
[{"$f":"IF(A114>0,A114,\"\")","v":"Luca Puls"},"07"]
[]
[{"$f":"IF(A116>0,A116,\"\")","v":"Yvo Vehling"},"07"]
[]
[{"$f":"IF(A118>0,A118,\"\")","v":"Timm Zuchold"},"07"]
[]
[{"$f":"IF(A120>0,A120,\"\")","v":""},""]
[]
[{"$f":"IF(A122>0,A122,\"\")","v":""},""]
[]
[{"$f":"IF(A124>0,A124,\"\")","v":""},""]
[]
[{"$f":"IF(A126>0,A126,\"\")","v":""},""]
[]
[{"$f":"IF(A128>0,A128,\"\")","v":""},""]
[]
[{"$f":"IF(A130>0,A130,\"\")","v":""},""]
[]
[{"$f":"IF(A132>0,A132,\"\")","v":""},""]
[]
[{"$f":"IF(A134>0,A134,\"\")","v":""},""]
[]
[]
["Name","Jg","Reck"]
[null,null,"D-Note","Abzug OK","E- Abzug","Note"]
[{"$f":"IF(A139>0,A139,\"\")","v":"Viktor Brauer"},{"$f":"IF(B139>0,B139,\"\")","v":"07"}]
[]
[{"$f":"IF(A141>0,A141,\"\")","v":"Norwin Eilers"},"07"]
[]
[{"$f":"IF(A143>0,A143,\"\")","v":"Thore Gruppe"},"07"]
[]
[{"$f":"IF(A145>0,A145,\"\")","v":"Jakob Kammel"},"07"]
[]
[{"$f":"IF(A147>0,A147,\"\")","v":"Luca Puls"},"07"]
[]
[{"$f":"IF(A149>0,A149,\"\")","v":"Yvo Vehling"},"07"]
[]
[{"$f":"IF(A151>0,A151,\"\")","v":"Timm Zuchold"},"07"]
[]
[{"$f":"IF(A153>0,A153,\"\")","v":""},""]
[]
[{"$f":"IF(A155>0,A155,\"\")","v":""},""]
[]
[{"$f":"IF(A157>0,A157,\"\")","v":""},""]
[]
[{"$f":"IF(A159>0,A159,\"\")","v":""},""]
[]
[{"$f":"IF(A161>0,A161,\"\")","v":""},""]
[]
[{"$f":"IF(A163>0,A163,\"\")","v":""},""]
[]
[{"$f":"IF(A165>0,A165,\"\")","v":""},""]
[]
[{"$f":"IF(A167>0,A167,\"\")","v":""},""]

{"sheet":"Wertungszettel M8","index":21,"n_rows":200,"n_cols":6,"rows_kept":200,"cut":false,"hidden":true,"merged":[[0,3,0,4],[1,3,1,4],[2,3,2,4],[4,2,4,5],[6,0,7,0],[6,1,7,1],[6,2,7,2],[6,3,7,3],[6,5,7,5],[8,0,9,0],[8,1,9,1],[8,2,9,2],[8,3,9,3],[8,5,9,5],[10,0,11,0],[10,1,11,1],[10,2,11,2],[10,3,11,3],[10,5,11,5],[12,0,13,0],[12,1,13,1],[12,2,13,2],[12,3,13,3],[12,5,13,5],[14,0,15,0],[14,1,15,1],[14,2,15,2],[14,3,15,3],[14,5,15,5],[16,0,17,0],[16,1,17,1],[16,2,17,2],[16,3,17,3],[16,5,17,5],[18,0,19,0],[18,1,19,1],[18,2,19,2],[18,3,19,3],[18,5,19,5],[20,0,21,0],[20,1,21,1],[20,2,21,2],[20,3,21,3],[20,5,21,5],[22,0,23,0],[22,1,23,1],[22,2,23,2],[22,3,23,3],[22,5,23,5],[24,0,25,0],[24,1,25,1],[24,2,25,2],[24,3,25,3],[24,5,25,5],[26,0,27,0],[26,1,27,1],[26,2,27,2],[26,3,27,3],[26,5,27,5],[28,0,29,0],[28,1,29,1],[28,2,29,2],[28,3,29,3],[28,5,29,5],[30,0,31,0],[30,1,31,1],[30,2,31,2],[30,3,31,3],[30,5,31,5],[37,2,37,5],[39,0,40,0],[39,1,40,1],[39,2,40,2],[39,3,40,3],[39,5,40,5],[32,0,33,0],[32,1,33,1],[32,2,33,2],[32,3,33,3],[32,5,33,5],[34,0,35,0],[34,1,35,1],[34,2,35,2],[34,3,35,3],[34,5,35,5],[41,0,42,0],[41,1,42,1],[41,2,42,2],[41,3,42,3],[41,5,42,5],[43,0,44,0],[43,1,44,1],[43,2,44,2],[43,3,44,3],[43,5,44,5],[45,0,46,0],[45,1,46,1],[45,2,46,2],[45,3,46,3],[45,5,46,5],[47,0,48,0],[47,1,48,1],[47,2,48,2],[47,3,48,3],[47,5,48,5],[49,0,50,0],[49,1,50,1],[49,2,50,2],[49,3,50,3],[49,5,50,5],[51,0,52,0],[51,1,52,1],[51,2,52,2],[51,3,52,3],[51,5,52,5],[53,0,54,0],[53,1,54,1],[53,2,54,2],[53,3,54,3],[53,5,54,5],[55,0,56,0],[55,1,56,1],[55,2,56,2],[55,3,56,3],[55,5,56,5],[57,0,58,0],[57,1,58,1],[57,2,58,2],[57,3,58,3],[57,5,58,5],[59,0,60,0],[59,1,60,1],[59,2,60,2],[59,3,60,3],[59,5,60,5],[61,0,62,0],[61,1,62,1],[61,2,62,2],[61,3,62,3],[61,5,62,5],[63,0,64,0],[63,1,64,1],[63,2,64,2],[63,3,64,3],[63,5,64,5],[70,2,70,5],[72,0,73,0],[72,1,73,1],[72,2,73,2],[72,3,73,3],[72,5,73,5],[65,0,66,0],[65,1,66,1],[65,2,66,2],[65,3,66,3],[65,5,66,5],[67,0,68,0],[67,1,68,1],[67,2,68,2],[67,3,68,3],[67,5,68,5],[74,0,75,0],[74,1,75,1],[74,2,75,2],[74,3,75,3],[74,5,75,5],[76,0,77,0],[76,1,77,1],[76,2,77,2],[76,3,77,3],[76,5,77,5],[78,0,79,0],[78,1,79,1],[78,2,79,2],[78,3,79,3],[78,5,79,5],[80,0,81,0],[80,1,81,1],[80,2,81,2],[80,3,81,3],[80,5,81,5],[82,0,83,0],[82,1,83,1],[82,2,83,2],[82,3,83,3],[82,5,83,5],[84,0,85,0],[84,1,85,1],[84,2,85,2],[84,3,85,3],[84,5,85,5],[86,0,87,0],[86,1,87,1],[86,2,87,2],[86,3,87,3],[86,5,87,5],[88,0,89,0],[88,1,89,1],[88,2,89,2],[88,3,89,3],[88,5,89,5],[90,0,91,0],[90,1,91,1],[90,2,91,2],[90,3,91,3],[90,5,91,5],[92,0,93,0],[92,1,93,1],[92,2,93,2],[92,3,93,3],[92,5,93,5],[94,0,95,0],[94,1,95,1],[94,2,95,2],[94,3,95,3],[94,5,95,5],[96,0,97,0],[96,1,97,1],[96,2,97,2],[96,3,97,3],[96,5,97,5],[103,2,103,5],[105,0,106,0],[105,1,106,1],[105,2,106,2],[105,3,106,3],[105,5,106,5],[98,0,99,0],[98,1,99,1],[98,2,99,2],[98,3,99,3],[98,5,99,5],[100,0,101,0],[100,1,101,1],[100,2,101,2],[100,3,101,3],[100,5,101,5],[107,0,108,0],[107,1,108,1],[107,2,108,2],[107,3,108,3],[107,5,108,5],[109,0,110,0],[109,1,110,1],[109,2,110,2],[109,3,110,3],[109,5,110,5],[111,0,112,0],[111,1,112,1],[111,2,112,2],[111,3,112,3],[111,5,112,5],[113,0,114,0],[113,1,114,1],[113,2,114,2],[113,3,114,3],[113,5,114,5],[115,0,116,0],[115,1,116,1],[115,2,116,2],[115,3,116,3],[115,5,116,5],[117,0,118,0],[117,1,118,1],[117,2,118,2],[117,3,118,3],[117,5,118,5],[119,0,120,0],[119,1,120,1],[119,2,120,2],[119,3,120,3],[119,5,120,5],[121,0,122,0],[121,1,122,1],[121,2,122,2],[121,3,122,3],[121,5,122,5],[123,0,124,0],[123,1,124,1],[123,2,124,2],[123,3,124,3],[123,5,124,5],[125,0,126,0],[125,1,126,1],[125,2,126,2],[125,3,126,3],[125,5,126,5],[127,0,128,0],[127,1,128,1],[127,2,128,2],[127,3,128,3],[127,5,128,5],[129,0,130,0],[129,1,130,1],[129,2,130,2],[129,3,130,3],[129,5,130,5],[136,2,136,5],[138,0,139,0],[138,1,139,1],[138,2,139,2],[138,3,139,3],[138,5,139,5],[131,0,132,0],[131,1,132,1],[131,2,132,2],[131,3,132,3],[131,5,132,5],[133,0,134,0],[133,1,134,1],[133,2,134,2],[133,3,134,3],[133,5,134,5],[140,0,141,0],[140,1,141,1],[140,2,141,2],[140,3,141,3],[140,5,141,5],[142,0,143,0],[142,1,143,1],[142,2,143,2],[142,3,143,3],[142,5,143,5],[144,0,145,0],[144,1,145,1],[144,2,145,2],[144,3,145,3],[144,5,145,5],[146,0,147,0],[146,1,147,1],[146,2,147,2],[146,3,147,3],[146,5,147,5],[148,0,149,0],[148,1,149,1],[148,2,149,2],[148,3,149,3],[148,5,149,5],[150,0,151,0],[150,1,151,1],[150,2,151,2],[150,3,151,3],[150,5,151,5],[152,0,153,0],[152,1,153,1],[152,2,153,2],[152,3,153,3],[152,5,153,5],[154,0,155,0],[154,1,155,1],[154,2,155,2],[154,3,155,3],[154,5,155,5],[156,0,157,0],[156,1,157,1],[156,2,157,2],[156,3,157,3],[156,5,157,5],[158,0,159,0],[158,1,159,1],[158,2,159,2],[158,3,159,3],[158,5,159,5],[160,0,161,0],[160,1,161,1],[160,2,161,2],[160,3,161,3],[160,5,161,5],[162,0,163,0],[162,1,163,1],[162,2,163,2],[162,3,163,3],[162,5,163,5],[169,2,169,5],[171,0,172,0],[171,1,172,1],[171,2,172,2],[171,3,172,3],[171,5,172,5],[164,0,165,0],[164,1,165,1],[164,2,165,2],[164,3,165,3],[164,5,165,5],[166,0,167,0],[166,1,167,1],[166,2,167,2],[166,3,167,3],[166,5,167,5],[173,0,174,0],[173,1,174,1],[173,2,174,2],[173,3,174,3],[173,5,174,5],[175,0,176,0],[175,1,176,1],[175,2,176,2],[175,3,176,3],[175,5,176,5],[177,0,178,0],[177,1,178,1],[177,2,178,2],[177,3,178,3],[177,5,178,5],[179,0,180,0],[179,1,180,1],[179,2,180,2],[179,3,180,3],[179,5,180,5],[181,0,182,0],[181,1,182,1],[181,2,182,2],[181,3,182,3],[181,5,182,5],[183,0,184,0],[183,1,184,1],[183,2,184,2],[183,3,184,3],[183,5,184,5],[185,0,186,0],[185,1,186,1],[185,2,186,2],[185,3,186,3],[185,5,186,5],[187,0,188,0],[187,1,188,1],[187,2,188,2],[187,3,188,3],[187,5,188,5],[189,0,190,0],[189,1,190,1],[189,2,190,2],[189,3,190,3],[189,5,190,5],[191,0,192,0],[191,1,192,1],[191,2,192,2],[191,3,192,3],[191,5,192,5],[193,0,194,0],[193,1,194,1],[193,2,194,2],[193,3,194,3],[193,5,194,5],[195,0,196,0],[195,1,196,1],[195,2,196,2],[195,3,196,3],[195,5,196,5],[197,0,198,0],[197,1,198,1],[197,2,198,2],[197,3,198,3],[197,5,198,5],[199,0,200,0],[199,1,200,1],[199,2,200,2],[199,3,200,3],[199,5,200,5]]}
["Wettkampfbogen",null,"Ort / Datum :",{"$f":"'INFO Blatt'!B11","v":"Hehlen"},null,{"$f":"'INFO Blatt'!B13","v":"2018-03-03"}]
[null,null,"Mannschaft:",{"$f":"Formeln!A12","v":"M8"},null,"Wertungsvorschriften"]
[null,null,"Liga:",{"$f":"'INFO Blatt'!B7","v":"Schülerliga Süd"},null,{"$f":"'INFO Blatt'!B5","v":"P-Stufen"}]
[]
["Name","Jg","Boden"]
[null,null,"D-Note","Abzug OK","E- Abzug","Note"]
[]
[]
[]
[]
[]
[]
[]
[]
[]
[]
[]
[]
[]
[]
[]
[]
[]
[]
[]
[]
[]
[]
[]
[]
[]
[]
[]
[]
[]
[]
[]
["Name","Jg","Pauschenpferd"]
[null,null,"D-Note","Abzug OK","E- Abzug","Note"]
[{"$f":"IF(A7>0,A7,\"\")","v":""},{"$f":"IF(B7>0,B7,\"\")","v":""}]
[]
[{"$f":"IF(A9>0,A9,\"\")","v":""},""]
[]
[{"$f":"IF(A11>0,A11,\"\")","v":""},""]
[]
[{"$f":"IF(A13>0,A13,\"\")","v":""},""]
[]
[{"$f":"IF(A15>0,A15,\"\")","v":""},""]
[]
[{"$f":"IF(A17>0,A17,\"\")","v":""},""]
[]
[{"$f":"IF(A19>0,A19,\"\")","v":""},""]
[]
[{"$f":"IF(A21>0,A21,\"\")","v":""},""]
[]
[{"$f":"IF(A23>0,A23,\"\")","v":""},""]
[]
[{"$f":"IF(A25>0,A25,\"\")","v":""},""]
[]
[{"$f":"IF(A27>0,A27,\"\")","v":""},""]
[]
[{"$f":"IF(A29>0,A29,\"\")","v":""},""]
[]
[{"$f":"IF(A31>0,A31,\"\")","v":""},""]
[]
[{"$f":"IF(A33>0,A33,\"\")","v":""},""]
[]
[{"$f":"IF(A35>0,A35,\"\")","v":""},""]
[]
[]
["Name","Jg","Ringe"]
[null,null,"D-Note","Abzug OK","E- Abzug","Note"]
[{"$f":"IF(A40>0,A40,\"\")","v":""},{"$f":"IF(B40>0,B40,\"\")","v":""}]
[]
[{"$f":"IF(A42>0,A42,\"\")","v":""},""]
[]
[{"$f":"IF(A44>0,A44,\"\")","v":""},""]
[]
[{"$f":"IF(A46>0,A46,\"\")","v":""},""]
[]
[{"$f":"IF(A48>0,A48,\"\")","v":""},""]
[]
[{"$f":"IF(A50>0,A50,\"\")","v":""},""]
[]
[{"$f":"IF(A52>0,A52,\"\")","v":""},""]
[]
[{"$f":"IF(A54>0,A54,\"\")","v":""},""]
[]
[{"$f":"IF(A56>0,A56,\"\")","v":""},""]
[]
[{"$f":"IF(A58>0,A58,\"\")","v":""},""]
[]
[{"$f":"IF(A60>0,A60,\"\")","v":""},""]
[]
[{"$f":"IF(A62>0,A62,\"\")","v":""},""]
[]
[{"$f":"IF(A64>0,A64,\"\")","v":""},""]
[]
[{"$f":"IF(A66>0,A66,\"\")","v":""},""]
[]
[{"$f":"IF(A68>0,A68,\"\")","v":""},""]
[]
[]
["Name","Jg","Sprung"]
[null,null,"D-Note","Abzug OK","E- Abzug","Note"]
[{"$f":"IF(A73>0,A73,\"\")","v":""},{"$f":"IF(B73>0,B73,\"\")","v":""}]
[]
[{"$f":"IF(A75>0,A75,\"\")","v":""},""]
[]
[{"$f":"IF(A77>0,A77,\"\")","v":""},""]
[]
[{"$f":"IF(A79>0,A79,\"\")","v":""},""]
[]
[{"$f":"IF(A81>0,A81,\"\")","v":""},""]
[]
[{"$f":"IF(A83>0,A83,\"\")","v":""},""]
[]
[{"$f":"IF(A85>0,A85,\"\")","v":""},""]
[]
[{"$f":"IF(A87>0,A87,\"\")","v":""},""]
[]
[{"$f":"IF(A89>0,A89,\"\")","v":""},""]
[]
[{"$f":"IF(A91>0,A91,\"\")","v":""},""]
[]
[{"$f":"IF(A93>0,A93,\"\")","v":""},""]
[]
[{"$f":"IF(A95>0,A95,\"\")","v":""},""]
[]
[{"$f":"IF(A97>0,A97,\"\")","v":""},""]
[]
[{"$f":"IF(A99>0,A99,\"\")","v":""},""]
[]
[{"$f":"IF(A101>0,A101,\"\")","v":""},""]
[]
[]
["Name","Jg","Barren"]
[null,null,"D-Note","Abzug OK","E- Abzug","Note"]
[{"$f":"IF(A106>0,A106,\"\")","v":""},{"$f":"IF(B106>0,B106,\"\")","v":""}]
[]
[{"$f":"IF(A108>0,A108,\"\")","v":""},""]
[]
[{"$f":"IF(A110>0,A110,\"\")","v":""},""]
[]
[{"$f":"IF(A112>0,A112,\"\")","v":""},""]
[]
[{"$f":"IF(A114>0,A114,\"\")","v":""},""]
[]
[{"$f":"IF(A116>0,A116,\"\")","v":""},""]
[]
[{"$f":"IF(A118>0,A118,\"\")","v":""},""]
[]
[{"$f":"IF(A120>0,A120,\"\")","v":""},""]
[]
[{"$f":"IF(A122>0,A122,\"\")","v":""},""]
[]
[{"$f":"IF(A124>0,A124,\"\")","v":""},""]
[]
[{"$f":"IF(A126>0,A126,\"\")","v":""},""]
[]
[{"$f":"IF(A128>0,A128,\"\")","v":""},""]
[]
[{"$f":"IF(A130>0,A130,\"\")","v":""},""]
[]
[{"$f":"IF(A132>0,A132,\"\")","v":""},""]
[]
[{"$f":"IF(A134>0,A134,\"\")","v":""},""]
[]
[]
["Name","Jg","Reck"]
[null,null,"D-Note","Abzug OK","E- Abzug","Note"]
[{"$f":"IF(A139>0,A139,\"\")","v":""},{"$f":"IF(B139>0,B139,\"\")","v":""}]
[]
[{"$f":"IF(A141>0,A141,\"\")","v":""},""]
[]
[{"$f":"IF(A143>0,A143,\"\")","v":""},""]
[]
[{"$f":"IF(A145>0,A145,\"\")","v":""},""]
[]
[{"$f":"IF(A147>0,A147,\"\")","v":""},""]
[]
[{"$f":"IF(A149>0,A149,\"\")","v":""},""]
[]
[{"$f":"IF(A151>0,A151,\"\")","v":""},""]
[]
[{"$f":"IF(A153>0,A153,\"\")","v":""},""]
[]
[{"$f":"IF(A155>0,A155,\"\")","v":""},""]
[]
[{"$f":"IF(A157>0,A157,\"\")","v":""},""]
[]
[{"$f":"IF(A159>0,A159,\"\")","v":""},""]
[]
[{"$f":"IF(A161>0,A161,\"\")","v":""},""]
[]
[{"$f":"IF(A163>0,A163,\"\")","v":""},""]
[]
[{"$f":"IF(A165>0,A165,\"\")","v":""},""]
[]
[{"$f":"IF(A167>0,A167,\"\")","v":""},""]

{"sheet":"Wertungszettel M9","index":22,"n_rows":68,"n_cols":14,"rows_kept":68,"cut":false,"hidden":true,"merged":[[1,4,1,5],[1,6,1,10],[4,2,4,5],[4,6,4,9],[4,10,4,13],[1,12,1,13],[0,4,0,5],[0,6,0,8],[8,0,9,0],[8,1,9,1],[8,2,9,2],[8,3,9,3],[8,5,9,5],[6,0,7,0],[6,1,7,1],[6,2,7,2],[6,3,7,3],[6,5,7,5],[8,6,9,6],[8,7,9,7],[8,9,9,9],[8,10,9,10],[8,11,9,11],[8,13,9,13],[6,7,7,7],[6,9,7,9],[6,10,7,10],[6,11,7,11],[6,13,7,13],[6,6,7,6],[12,0,13,0],[12,1,13,1],[12,2,13,2],[12,3,13,3],[12,5,13,5],[10,0,11,0],[10,1,11,1],[10,2,11,2],[10,3,11,3],[10,5,11,5],[12,6,13,6],[12,7,13,7],[12,9,13,9],[12,10,13,10],[12,11,13,11],[12,13,13,13],[10,7,11,7],[10,9,11,9],[10,10,11,10],[10,11,11,11],[10,13,11,13],[10,6,11,6],[16,0,17,0],[16,1,17,1],[16,2,17,2],[16,3,17,3],[16,5,17,5],[14,0,15,0],[14,1,15,1],[14,2,15,2],[14,3,15,3],[14,5,15,5],[16,6,17,6],[16,7,17,7],[16,9,17,9],[16,10,17,10],[16,11,17,11],[16,13,17,13],[14,7,15,7],[14,9,15,9],[14,10,15,10],[14,11,15,11],[14,13,15,13],[14,6,15,6],[20,0,21,0],[20,1,21,1],[20,2,21,2],[20,3,21,3],[20,5,21,5],[18,0,19,0],[18,1,19,1],[18,2,19,2],[18,3,19,3],[18,5,19,5],[20,6,21,6],[20,7,21,7],[20,9,21,9],[20,10,21,10],[20,11,21,11],[20,13,21,13],[18,7,19,7],[18,9,19,9],[18,10,19,10],[18,11,19,11],[18,13,19,13],[18,6,19,6],[24,0,25,0],[24,1,25,1],[24,2,25,2],[24,3,25,3],[24,5,25,5],[22,0,23,0],[22,1,23,1],[22,2,23,2],[22,3,23,3],[22,5,23,5],[24,6,25,6],[24,7,25,7],[24,9,25,9],[24,10,25,10],[24,11,25,11],[24,13,25,13],[22,7,23,7],[22,9,23,9],[22,10,23,10],[22,11,23,11],[22,13,23,13],[22,6,23,6],[28,0,29,0],[28,1,29,1],[28,2,29,2],[28,3,29,3],[28,5,29,5],[26,0,27,0],[26,1,27,1],[26,2,27,2],[26,3,27,3],[26,5,27,5],[28,6,29,6],[28,7,29,7],[28,9,29,9],[28,10,29,10],[28,11,29,11],[28,13,29,13],[26,7,27,7],[26,9,27,9],[26,10,27,10],[26,11,27,11],[26,13,27,13],[26,6,27,6],[32,0,33,0],[32,1,33,1],[32,2,33,2],[32,3,33,3],[32,5,33,5],[30,0,31,0],[30,1,31,1],[30,2,31,2],[30,3,31,3],[30,5,31,5],[32,6,33,6],[32,7,33,7],[32,9,33,9],[32,10,33,10],[32,11,33,11],[32,13,33,13],[30,7,31,7],[30,9,31,9],[30,10,31,10],[30,11,31,11],[30,13,31,13],[30,6,31,6],[34,7,35,7],[34,9,35,9],[34,10,35,10],[34,11,35,11],[34,13,35,13],[37,2,37,5],[37,6,37,9],[37,10,37,13],[34,0,35,0],[34,1,35,1],[34,2,35,2],[34,3,35,3],[34,5,35,5],[34,6,35,6],[41,0,42,0],[41,1,42,1],[41,2,42,2],[41,3,42,3],[41,5,42,5],[39,0,40,0],[39,1,40,1],[39,2,40,2],[39,3,40,3],[39,5,40,5],[41,6,42,6],[41,7,42,7],[41,9,42,9],[41,10,42,10],[41,11,42,11],[41,13,42,13],[39,7,40,7],[39,9,40,9],[39,10,40,10],[39,11,40,11],[39,13,40,13],[39,6,40,6],[45,0,46,0],[45,1,46,1],[45,2,46,2],[45,3,46,3],[45,5,46,5],[43,0,44,0],[43,1,44,1],[43,2,44,2],[43,3,44,3],[43,5,44,5],[45,6,46,6],[45,7,46,7],[45,9,46,9],[45,10,46,10],[45,11,46,11],[45,13,46,13],[43,7,44,7],[43,9,44,9],[43,10,44,10],[43,11,44,11],[43,13,44,13],[43,6,44,6],[49,0,50,0],[49,1,50,1],[49,2,50,2],[49,3,50,3],[49,5,50,5],[47,0,48,0],[47,1,48,1],[47,2,48,2],[47,3,48,3],[47,5,48,5],[49,6,50,6],[49,7,50,7],[49,9,50,9],[49,10,50,10],[49,11,50,11],[49,13,50,13],[47,7,48,7],[47,9,48,9],[47,10,48,10],[47,11,48,11],[47,13,48,13],[47,6,48,6],[53,0,54,0],[53,1,54,1],[53,2,54,2],[53,3,54,3],[53,5,54,5],[51,0,52,0],[51,1,52,1],[51,2,52,2],[51,3,52,3],[51,5,52,5],[53,6,54,6],[53,7,54,7],[53,9,54,9],[53,10,54,10],[53,11,54,11],[53,13,54,13],[51,7,52,7],[51,9,52,9],[51,10,52,10],[51,11,52,11],[51,13,52,13],[51,6,52,6],[57,0,58,0],[57,1,58,1],[57,2,58,2],[57,3,58,3],[57,5,58,5],[55,0,56,0],[55,1,56,1],[55,2,56,2],[55,3,56,3],[55,5,56,5],[57,6,58,6],[57,7,58,7],[57,9,58,9],[57,10,58,10],[57,11,58,11],[57,13,58,13],[55,7,56,7],[55,9,56,9],[55,10,56,10],[55,11,56,11],[55,13,56,13],[55,6,56,6],[59,13,60,13],[61,0,62,0],[61,1,62,1],[61,2,62,2],[61,3,62,3],[61,5,62,5],[59,0,60,0],[59,1,60,1],[59,2,60,2],[59,3,60,3],[59,5,60,5],[59,6,60,6],[63,0,64,0],[63,1,64,1],[63,2,64,2],[63,3,64,3],[63,5,64,5],[63,6,64,6],[61,6,62,6],[61,7,62,7],[61,9,62,9],[67,0,68,0],[67,1,68,1],[67,2,68,2],[67,3,68,3],[67,5,68,5],[67,6,68,6],[65,6,66,6],[65,7,66,7],[65,9,66,9],[65,0,66,0],[65,1,66,1],[65,2,66,2],[65,3,66,3],[65,5,66,5],[0,9,0,10],[67,7,68,7],[67,9,68,9],[67,10,68,10],[67,11,68,11],[67,13,68,13],[2,4,2,5],[2,6,2,10],[2,12,2,13],[65,10,66,10],[65,11,66,11],[65,13,66,13],[63,7,64,7],[63,9,64,9],[63,10,64,10],[63,11,64,11],[63,13,64,13],[61,10,62,10],[61,11,62,11],[61,13,62,13],[59,7,60,7],[59,9,60,9],[59,10,60,10],[59,11,60,11]]}
["Wettkampfbogen",null,null,null,"Ort / Datum :",null,{"$f":"'INFO Blatt'!B11","v":"Hehlen"},null,null,{"$f":"'INFO Blatt'!B13","v":"2018-03-03"}]
[null,null,null,null,"Mannschaft:",null,{"$f":"Formeln!A13","v":"M9"},null,null,null,null,null,"Wertungsvorschriften"]
[null,null,null,null,"Liga:",null,{"$f":"'INFO Blatt'!B7","v":"Schülerliga Süd"},null,null,null,null,null,{"$f":"'INFO Blatt'!B5","v":"P-Stufen"}]
[]
["Name","Jg","Boden",null,null,null,"Ringe",null,null,null,"Barren"]
[null,null,"D-Note","Abzug OK","E- Abzug","Note","D-Note","Abzug OK","E- Abzug","Note","D-Note","Abzug OK","E-Abzug","Note"]
[9,{"$f":"IF('Einbeck 1'!C9>0,'Einbeck 1'!C9,\"\")","v":"07"}]
[]
[null,{"$f":"IF('Einbeck 1'!C11>0,'Einbeck 1'!C11,\"\")","v":"05"}]
[]
[null,{"$f":"IF('Einbeck 1'!C13>0,'Einbeck 1'!C13,\"\")","v":"05"}]
[]
[null,{"$f":"IF('Einbeck 1'!C15>0,'Einbeck 1'!C15,\"\")","v":"06"}]
[]
[null,{"$f":"IF('Einbeck 1'!C17>0,'Einbeck 1'!C17,\"\")","v":"09"}]
[]
[null,{"$f":"IF('Einbeck 1'!C19>0,'Einbeck 1'!C19,\"\")","v":"05"}]
[]
[null,{"$f":"IF('Einbeck 1'!C21>0,'Einbeck 1'!C21,\"\")","v":"06"}]
[]
[null,{"$f":"IF('Einbeck 1'!C23>0,'Einbeck 1'!C23,\"\")","v":"07"}]
[]
[null,{"$f":"IF('Einbeck 1'!C25>0,'Einbeck 1'!C25,\"\")","v":"06"}]
[]
[null,{"$f":"IF('Einbeck 1'!C27>0,'Einbeck 1'!C27,\"\")","v":""}]
[]
[]
[]
[]
[]
[]
[]
[null,{"$f":"IF('Einbeck 1'!C31>0,'Einbeck 1'!C31,\"\")","v":""}]
[]
[null,{"$f":"IF('Einbeck 1'!C33>0,'Einbeck 1'!C33,\"\")","v":""}]
[]
[]
["Name","Jg","Pauschenpferd",null,null,null,"Sprung",null,null,null,"Reck"]
[null,null,"D-Note","Abzug OK","E- Abzug","Note","D-Note","Abzug OK","E- Abzug","Note","D-Note","Abzug OK","E-Abzug","Note"]
[{"$f":"IF(A7>0,A7,\"\")","v":9},{"$f":"IF(B7>0,B7,\"\")","v":"07"}]
[]
[{"$f":"IF(A9>0,A9,\"\")","v":""},"05"]
[]
[{"$f":"IF(A11>0,A11,\"\")","v":""},"05"]
[]
[{"$f":"IF(A13>0,A13,\"\")","v":""},"06"]
[]
[{"$f":"IF(A15>0,A15,\"\")","v":""},"09"]
[]
[{"$f":"IF(A17>0,A17,\"\")","v":""},"05"]
[]
[{"$f":"IF(A19>0,A19,\"\")","v":""},"06"]
[]
[{"$f":"IF(A21>0,A21,\"\")","v":""},"07"]
[]
[{"$f":"IF(A23>0,A23,\"\")","v":""},"06"]
[]
[{"$f":"IF(A25>0,A25,\"\")","v":""},""]
[]
[{"$f":"IF(A27>0,A27,\"\")","v":""},""]
[]
[{"$f":"IF(A29>0,A29,\"\")","v":""},""]
[]
[{"$f":"IF(A31>0,A31,\"\")","v":""},""]
[]
[{"$f":"IF(A33>0,A33,\"\")","v":""},""]
[]
[{"$f":"IF(A35>0,A35,\"\")","v":""},""]

{"sheet":"Wertungszettel M10","index":23,"n_rows":68,"n_cols":14,"rows_kept":68,"cut":false,"hidden":true,"merged":[[1,4,1,5],[1,6,1,10],[4,2,4,5],[4,6,4,9],[4,10,4,13],[1,12,1,13],[0,4,0,5],[0,6,0,8],[8,0,9,0],[8,1,9,1],[8,2,9,2],[8,3,9,3],[8,5,9,5],[6,0,7,0],[6,1,7,1],[6,2,7,2],[6,3,7,3],[6,5,7,5],[8,6,9,6],[8,7,9,7],[8,9,9,9],[8,10,9,10],[8,11,9,11],[8,13,9,13],[6,7,7,7],[6,9,7,9],[6,10,7,10],[6,11,7,11],[6,13,7,13],[6,6,7,6],[12,0,13,0],[12,1,13,1],[12,2,13,2],[12,3,13,3],[12,5,13,5],[10,0,11,0],[10,1,11,1],[10,2,11,2],[10,3,11,3],[10,5,11,5],[12,6,13,6],[12,7,13,7],[12,9,13,9],[12,10,13,10],[12,11,13,11],[12,13,13,13],[10,7,11,7],[10,9,11,9],[10,10,11,10],[10,11,11,11],[10,13,11,13],[10,6,11,6],[16,0,17,0],[16,1,17,1],[16,2,17,2],[16,3,17,3],[16,5,17,5],[14,0,15,0],[14,1,15,1],[14,2,15,2],[14,3,15,3],[14,5,15,5],[16,6,17,6],[16,7,17,7],[16,9,17,9],[16,10,17,10],[16,11,17,11],[16,13,17,13],[14,7,15,7],[14,9,15,9],[14,10,15,10],[14,11,15,11],[14,13,15,13],[14,6,15,6],[20,0,21,0],[20,1,21,1],[20,2,21,2],[20,3,21,3],[20,5,21,5],[18,0,19,0],[18,1,19,1],[18,2,19,2],[18,3,19,3],[18,5,19,5],[20,6,21,6],[20,7,21,7],[20,9,21,9],[20,10,21,10],[20,11,21,11],[20,13,21,13],[18,7,19,7],[18,9,19,9],[18,10,19,10],[18,11,19,11],[18,13,19,13],[18,6,19,6],[24,0,25,0],[24,1,25,1],[24,2,25,2],[24,3,25,3],[24,5,25,5],[22,0,23,0],[22,1,23,1],[22,2,23,2],[22,3,23,3],[22,5,23,5],[24,6,25,6],[24,7,25,7],[24,9,25,9],[24,10,25,10],[24,11,25,11],[24,13,25,13],[22,7,23,7],[22,9,23,9],[22,10,23,10],[22,11,23,11],[22,13,23,13],[22,6,23,6],[28,0,29,0],[28,1,29,1],[28,2,29,2],[28,3,29,3],[28,5,29,5],[26,0,27,0],[26,1,27,1],[26,2,27,2],[26,3,27,3],[26,5,27,5],[28,6,29,6],[28,7,29,7],[28,9,29,9],[28,10,29,10],[28,11,29,11],[28,13,29,13],[26,7,27,7],[26,9,27,9],[26,10,27,10],[26,11,27,11],[26,13,27,13],[26,6,27,6],[32,0,33,0],[32,1,33,1],[32,2,33,2],[32,3,33,3],[32,5,33,5],[30,0,31,0],[30,1,31,1],[30,2,31,2],[30,3,31,3],[30,5,31,5],[32,6,33,6],[32,7,33,7],[32,9,33,9],[32,10,33,10],[32,11,33,11],[32,13,33,13],[30,7,31,7],[30,9,31,9],[30,10,31,10],[30,11,31,11],[30,13,31,13],[30,6,31,6],[34,7,35,7],[34,9,35,9],[34,10,35,10],[34,11,35,11],[34,13,35,13],[37,2,37,5],[37,6,37,9],[37,10,37,13],[34,0,35,0],[34,1,35,1],[34,2,35,2],[34,3,35,3],[34,5,35,5],[34,6,35,6],[41,0,42,0],[41,1,42,1],[41,2,42,2],[41,3,42,3],[41,5,42,5],[39,0,40,0],[39,1,40,1],[39,2,40,2],[39,3,40,3],[39,5,40,5],[41,6,42,6],[41,7,42,7],[41,9,42,9],[41,10,42,10],[41,11,42,11],[41,13,42,13],[39,7,40,7],[39,9,40,9],[39,10,40,10],[39,11,40,11],[39,13,40,13],[39,6,40,6],[45,0,46,0],[45,1,46,1],[45,2,46,2],[45,3,46,3],[45,5,46,5],[43,0,44,0],[43,1,44,1],[43,2,44,2],[43,3,44,3],[43,5,44,5],[45,6,46,6],[45,7,46,7],[45,9,46,9],[45,10,46,10],[45,11,46,11],[45,13,46,13],[43,7,44,7],[43,9,44,9],[43,10,44,10],[43,11,44,11],[43,13,44,13],[43,6,44,6],[49,0,50,0],[49,1,50,1],[49,2,50,2],[49,3,50,3],[49,5,50,5],[47,0,48,0],[47,1,48,1],[47,2,48,2],[47,3,48,3],[47,5,48,5],[49,6,50,6],[49,7,50,7],[49,9,50,9],[49,10,50,10],[49,11,50,11],[49,13,50,13],[47,7,48,7],[47,9,48,9],[47,10,48,10],[47,11,48,11],[47,13,48,13],[47,6,48,6],[53,0,54,0],[53,1,54,1],[53,2,54,2],[53,3,54,3],[53,5,54,5],[51,0,52,0],[51,1,52,1],[51,2,52,2],[51,3,52,3],[51,5,52,5],[53,6,54,6],[53,7,54,7],[53,9,54,9],[53,10,54,10],[53,11,54,11],[53,13,54,13],[51,7,52,7],[51,9,52,9],[51,10,52,10],[51,11,52,11],[51,13,52,13],[51,6,52,6],[57,0,58,0],[57,1,58,1],[57,2,58,2],[57,3,58,3],[57,5,58,5],[55,0,56,0],[55,1,56,1],[55,2,56,2],[55,3,56,3],[55,5,56,5],[57,6,58,6],[57,7,58,7],[57,9,58,9],[57,10,58,10],[57,11,58,11],[57,13,58,13],[55,7,56,7],[55,9,56,9],[55,10,56,10],[55,11,56,11],[55,13,56,13],[55,6,56,6],[59,13,60,13],[61,0,62,0],[61,1,62,1],[61,2,62,2],[61,3,62,3],[61,5,62,5],[59,0,60,0],[59,1,60,1],[59,2,60,2],[59,3,60,3],[59,5,60,5],[59,6,60,6],[63,0,64,0],[63,1,64,1],[63,2,64,2],[63,3,64,3],[63,5,64,5],[63,6,64,6],[61,6,62,6],[61,7,62,7],[61,9,62,9],[67,0,68,0],[67,1,68,1],[67,2,68,2],[67,3,68,3],[67,5,68,5],[67,6,68,6],[65,6,66,6],[65,7,66,7],[65,9,66,9],[65,0,66,0],[65,1,66,1],[65,2,66,2],[65,3,66,3],[65,5,66,5],[0,9,0,10],[67,7,68,7],[67,9,68,9],[67,10,68,10],[67,11,68,11],[67,13,68,13],[2,4,2,5],[2,6,2,10],[2,12,2,13],[65,10,66,10],[65,11,66,11],[65,13,66,13],[63,7,64,7],[63,9,64,9],[63,10,64,10],[63,11,64,11],[63,13,64,13],[61,10,62,10],[61,11,62,11],[61,13,62,13],[59,7,60,7],[59,9,60,9],[59,10,60,10],[59,11,60,11]]}
["Wettkampfbogen",null,null,null,"Ort / Datum :",null,{"$f":"'INFO Blatt'!B11","v":"Hehlen"},null,null,{"$f":"'INFO Blatt'!B13","v":"2018-03-03"}]
[null,null,null,null,"Mannschaft:",null,{"$f":"Formeln!A14","v":"M10"},null,null,null,null,null,"Wertungsvorschriften"]
[null,null,null,null,"Liga:",null,{"$f":"'INFO Blatt'!B7","v":"Schülerliga Süd"},null,null,null,null,null,{"$f":"'INFO Blatt'!B5","v":"P-Stufen"}]
[]
["Name","Jg","Boden",null,null,null,"Ringe",null,null,null,"Barren"]
[null,null,"D-Note","Abzug OK","E- Abzug","Note","D-Note","Abzug OK","E- Abzug","Note","D-Note","Abzug OK","E-Abzug","Note"]
[10,{"$f":"IF('Einbeck 2'!C9>0,'Einbeck 2'!C9,\"\")","v":"07"}]
[]
[null,{"$f":"IF('Einbeck 2'!C11>0,'Einbeck 2'!C11,\"\")","v":"07"}]
[]
[null,{"$f":"IF('Einbeck 2'!C13>0,'Einbeck 2'!C13,\"\")","v":"07"}]
[]
[null,{"$f":"IF('Einbeck 2'!C15>0,'Einbeck 2'!C15,\"\")","v":"06"}]
[]
[null,{"$f":"IF('Einbeck 2'!C17>0,'Einbeck 2'!C17,\"\")","v":"06"}]
[]
[null,{"$f":"IF('Einbeck 2'!C19>0,'Einbeck 2'!C19,\"\")","v":""}]
[]
[null,{"$f":"IF('Einbeck 2'!C21>0,'Einbeck 2'!C21,\"\")","v":""}]
[]
[null,{"$f":"IF('Einbeck 2'!C23>0,'Einbeck 2'!C23,\"\")","v":""}]
[]
[null,{"$f":"IF('Einbeck 2'!C25>0,'Einbeck 2'!C25,\"\")","v":""}]
[]
[null,{"$f":"IF('Einbeck 2'!C27>0,'Einbeck 2'!C27,\"\")","v":""}]
[]
[]
[]
[]
[]
[null,{"$f":"IF('Einbeck 2'!C29>0,'Einbeck 2'!C29,\"\")","v":""}]
[]
[null,{"$f":"IF('Einbeck 2'!C31>0,'Einbeck 2'!C31,\"\")","v":""}]
[]
[null,{"$f":"IF('Einbeck 2'!C33>0,'Einbeck 2'!C33,\"\")","v":""}]
[]
[]
["Name","Jg","Pauschenpferd",null,null,null,"Sprung",null,null,null,"Reck"]
[null,null,"D-Note","Abzug OK","E- Abzug","Note","D-Note","Abzug OK","E- Abzug","Note","D-Note","Abzug OK","E-Abzug","Note"]
[{"$f":"IF(A7>0,A7,\"\")","v":10},{"$f":"IF(B7>0,B7,\"\")","v":"07"}]
[]
[{"$f":"IF(A9>0,A9,\"\")","v":""},"07"]
[]
[{"$f":"IF(A11>0,A11,\"\")","v":""},"07"]
[]
[{"$f":"IF(A13>0,A13,\"\")","v":""},"06"]
[]
[{"$f":"IF(A15>0,A15,\"\")","v":""},"06"]
[]
[{"$f":"IF(A17>0,A17,\"\")","v":""},""]
[]
[{"$f":"IF(A19>0,A19,\"\")","v":""},""]
[]
[{"$f":"IF(A21>0,A21,\"\")","v":""},""]
[]
[{"$f":"IF(A23>0,A23,\"\")","v":""},""]
[]
[{"$f":"IF(A25>0,A25,\"\")","v":""},""]
[]
[{"$f":"IF(A27>0,A27,\"\")","v":""},""]
[]
[{"$f":"IF(A29>0,A29,\"\")","v":""},""]
[]
[{"$f":"IF(A31>0,A31,\"\")","v":""},""]
[]
[{"$f":"IF(A33>0,A33,\"\")","v":""},""]
[]
[{"$f":"IF(A35>0,A35,\"\")","v":""},""]